{"text_format":"1","workbook":"xlsx","n_sheets":21,"sheets":["Hipervínculos","Asistencia a Cine en Colombia","Ind de Asistencia a Cine en Col","Taquilla en Colombia","Estrenos de películas Col.","Asistencia a películas Col.","5 más taquilleras en Colombia","5 más taquilleras Colombianas","Población","PIB habitante","Internacionales","Aprobado FDC","Destino FDC y ANEXO 2","Tributarios","Informe Especial 1","Salas de Exhibición","Asistencia cine por ciudades","Evo. prom boleta en Col.","Evo. prom boleta por Ciudad","Evo. prom boleta por Exhibidor","Hoja1"],"not_rendered":{"charts":34,"images":2,"macros":0,"external_links":1,"defined_names":2,"comments":1,"pivot_tables":0},"unopened":[],"bounds":{"document_bytes":16777216,"sheet_cells":100000,"rows_first":2000,"rows_last":500,"rows_between":2000,"halvings":0,"cell_chars":16384,"cell_head_chars":4096},"cells_cut":0,"cells_raw":0,"read":"whole","date_system":"1900"}

{"sheet":"Hipervínculos","index":0,"n_rows":127,"n_cols":2,"rows_kept":127,"cut":false,"hidden":false,"merged":[]}
["Listado de gráficos  - Boletín primer semestre"]
["(Listado de hipervínculos)"]
[]
["Asistencia a cine en Colombia"]
["1996 – Junio 2011"]
[]
[]
["Índice de asistencia a cine en Colombia"]
["1996 – 2011*"]
[]
[]
["Taquilla del mercado cinematográfico en Colombia"]
["1996 – Junio 2011"]
[]
[]
["Estrenos cinematográficos en Colombia"]
["1996 – Junio 2011"]
[]
[]
["Estreno de películas colombianas"]
["1996 – Junio 2011"]
[]
[]
["Asistencia a películas colombianas"]
["1996 – Junio 2011"]
[]
[]
["Participación de las películas nacionales en el total de estrenos en Colombia"]
["1996 – Junio  2011"]
[]
[]
["Participación de las películas nacionales en el total de asistencia en Colombia"]
["1996 – Junio  2011"]
[]
["Participación de las películas nacionales en el total de estrenos y asistencia en Colombia"]
["1996 – Junio  2011"]
[]
[]
["Las cinco películas más taquilleras por año en Colombia"]
["2007 – Junio  2011"]
[]
[]
["Las cinco películas colombianas más taquilleras por año"]
["2007 – Junio  2011"]
[]
["Tamaño relativo de Colombia: Población y PIB por habitante"]
["Población","PIB por habitante"]
[]
["Asistencia a cine en algunos países iberoamericanos y Estados Unidos/Canadá. 2000-2010"]
[]
[]
["Índice de asistencia en algunos países iberoamericanos y Estados Unidos/Canadá. 2000-2010"]
[]
["Estrenos de largometrajes nacionales en algunos países iberoamericanos y Estados Unidos/Canadá. 2000-2010"]
[]
[]
["Asistencia a  largometrajes nacionales en algunos países iberoamericanos "]
["2007 – 2010"]
[]
[]
["Participación promedio de los espectadores de largometrajes nacionales en el total de espectadores en algunos países iberoamericanos "]
["2007 – 2010"]
[]
[]
["Recursos  aprobados para el FDC"]
["Millones de pesos corrientes. 2004 - 2011*"]
[]
[]
["Asignación de los estímulos aprobados para el FDC"]
["Millones de pesos corrientes. 2004 - 2011*"]
[]
[]
["Estímulos aprobados para el FDC*- Producción 70%"]
["Millones de pesos corrientes. 2004 - 2011*"]
[]
[]
["Estímulos tributarios"]
["Millones de pesos corrientes. 2004 - 2010*"]
[]
[]
["INFORME ESPECIAL"]
[]
["Gráfico 1"]
["Asistencia a cine en Colombia"]
["1996 – Junio 2011"]
[]
["Gráfico 2"]
["Asistencia a cine en algunos países iberoamericanos y Estados Unidos/Canadá. 2000-2010"]
[]
["Gráfico 3"]
["Índice de asistencia en algunos países iberoamericanos y Estados Unidos/Canadá. 2000-2010"]
[]
[]
["Gráfico 4"]
["Índice de asistencia y crecimiento de la economía"]
[" 2000-2010"]
[]
[]
["Gráfico 5"]
["Salas de exhibición en Colombia"]
["2006 –  2011*"]
[]
[]
["Gráfico 6"]
["Asistencia a cine en las principales ciudades"]
["2007 - 2011*"]
[]
[]
["Gráfico 7"]
["Variación anual del número de espectadores  por ciudad"]
[]
[]
["Gráfico 8"]
["Evolución real del precio promedio de la boleta en Colombia"]
["1996 - 2011*"]
[]
[]
["GRÁFICOS PARA  EN  SEGUNDO PLANO"]
[]
["Mercado cinematográfico por ciudad. 2010"]
["Asistencia","Taquilla"]
[]
["Evolución real del precio promedio de la boleta por ciudad"]
[]
["Participación de los exhibidores por ciudad. 2010"]
[]
["Evolución real del precio promedio de la boleta por exhibidor"]

{"sheet":"Asistencia a Cine en Colombia","index":1,"n_rows":60,"n_cols":7,"rows_kept":60,"cut":false,"hidden":false,"merged":[]}
[null,{"$f":"+[1]a1_ind!AN6","v":"Espectadores"},{"$f":"+[1]a5_ind!AH2","v":"Películas colombianas"}]
[null,null,{"$f":"+[1]a5_ind!AH3","v":"Espectatores"},"Asistencia","Estrenos",null,"Asistencia a cine en Colombia"]
[{"$f":"+[1]a1_ind!AM7","v":1990},{"$f":"+[1]a1_ind!AN7","v":26400000},null,null,null,null,"1996 – Junio 2011"]
[{"$f":"+[1]a1_ind!AM8","v":1991},{"$f":"+[1]a1_ind!AN8","v":25200000}]
[{"$f":"+[1]a1_ind!AM9","v":1992},{"$f":"+[1]a1_ind!AN9","v":18700000}]
[{"$f":"+[1]a1_ind!AM10","v":1993},{"$f":"+[1]a1_ind!AN10","v":17600000}]
[{"$f":"+[1]a1_ind!AM11","v":1994},{"$f":"+[1]a1_ind!AN11","v":17500000}]
[{"$f":"+[1]a1_ind!AM12","v":1995},{"$f":"+[1]a1_ind!AN12","v":17500000}]
[{"$f":"+[1]a1_ind!AM13","v":1996},{"$f":"+[1]a1_ind!AN13","v":18050000},{"$f":"+[1]a5_ind!AH4","v":987000},{"$f":"+C9/B9*100","v":5.4681440443213294},{"$f":"+'Estrenos de películas Col.'!D5","v":1.098901098901099}]
[{"$f":"+[1]a1_ind!AM14","v":1997},{"$f":"+[1]a1_ind!AN14","v":17850000},{"$f":"+[1]a5_ind!AH5","v":100000},{"$f":"+C10/B10*100","v":0.56022408963585435},{"$f":"+'Estrenos de películas Col.'!D6","v":0.3968253968253968}]
[{"$f":"+[1]a1_ind!AM15","v":1998},{"$f":"+[1]a1_ind!AN15","v":18350000},{"$f":"+[1]a5_ind!AH6","v":1422000},7.7493188010899186,{"$f":"+'Estrenos de películas Col.'!D7","v":1.6597510373443984}]
[{"$f":"+[1]a1_ind!AM16","v":1999},{"$f":"+[1]a1_ind!AN16","v":15990000},{"$f":"+[1]a5_ind!AH7","v":112000},0.70043777360850534,{"$f":"+'Estrenos de películas Col.'!D8","v":1.2195121951219512}]
[{"$f":"+[1]a1_ind!AM17","v":2000},{"$f":"+[1]a1_ind!AN17","v":17200000},{"$f":"+[1]a5_ind!AH8","v":618000},3.5930232558139532,{"$f":"+'Estrenos de películas Col.'!D9","v":1.9607843137254901}]
[{"$f":"+[1]a1_ind!AM18","v":2001},{"$f":"+[1]a1_ind!AN18","v":17798000},{"$f":"+[1]a5_ind!AH9","v":84000},0.47196314192605909,{"$f":"+'Estrenos de películas Col.'!D10","v":3.4482758620689653}]
[{"$f":"+[1]a1_ind!AM19","v":2002},{"$f":"+[1]a1_ind!AN19","v":18399000},{"$f":"+[1]a5_ind!AH10","v":854541},4.644496983531714,{"$f":"+'Estrenos de películas Col.'!D11","v":2.2222222222222223}]
[{"$f":"+[1]a1_ind!AM20","v":2003},{"$f":"+[1]a1_ind!AN20","v":17086000},{"$f":"+[1]a5_ind!AH11","v":577304},3.3788130633267,{"$f":"+'Estrenos de películas Col.'!D12","v":2.8571428571428572}]
[{"$f":"+[1]a1_ind!AM21","v":2004},{"$f":"+[1]a1_ind!AN21","v":17122000},{"$f":"+[1]a5_ind!AH12","v":944700},5.5174629132110731,{"$f":"+'Estrenos de películas Col.'!D13","v":4.7904191616766472}]
[{"$f":"+[1]a1_ind!AM22","v":2005},{"$f":"+[1]a1_ind!AN22","v":15940000},{"$f":"+[1]a5_ind!AH13","v":1979106},12.415972396486826,{"$f":"+'Estrenos de películas Col.'!D14","v":4.8780487804878048}]
[{"$f":"+[1]a1_ind!AM23","v":2006},{"$f":"+[1]a1_ind!AN23","v":20216614},{"$f":"+[1]a5_ind!AH14","v":2806892},13.884085633726794,{"$f":"+'Estrenos de películas Col.'!D15","v":4.9382716049382713}]
[{"$f":"+[1]a1_ind!AM24","v":2007},{"$f":"+[1]a1_ind!AN24","v":20668958},{"$f":"+[1]a5_ind!AH15","v":2387135},11.549372735674435,{"$f":"+'Estrenos de películas Col.'!D16","v":5.0505050505050502}]
[{"$f":"+[1]a1_ind!AM25","v":2008},{"$f":"+[1]a1_ind!AN25","v":21562877},{"$f":"+[1]a5_ind!AH16","v":2278429},10.566442502083557,{"$f":"+'Estrenos de películas Col.'!D17","v":6.5}]
[{"$f":"+[1]a1_ind!AM26","v":2009},{"$f":"+[1]a1_ind!AN26","v":27067685},{"$f":"+[1]a5_ind!AH17","v":1208280},4.4639207231796885,{"$f":"+'Estrenos de películas Col.'!D18","v":5.6074766355140184}]
[{"$f":"+[1]a1_ind!AM27","v":2010},{"$f":"+[1]a1_ind!AN27","v":33655091},{"$f":"+[1]a5_ind!AH18","v":1530700},4.548197477760497,{"$f":"+'Estrenos de películas Col.'!D19","v":4.8309178743961354}]
[{"$f":"+[1]a1_ind!AM28","v":"2010*"},{"$f":"+[1]a1_ind!AN28","v":16639700},{"$f":"+[1]a5_ind!AH19","v":767323},4.6113992439767539,{"$f":"+'Estrenos de películas Col.'!D20","v":4.7619047619047619}]
[{"$f":"+[1]a1_ind!AM29","v":"2011*"},{"$f":"+[1]a1_ind!AN29","v":19047893},{"$f":"+[1]a5_ind!AH20","v":2176843},11.428261383030659,{"$f":"+'Estrenos de películas Col.'!D21","v":5.9405940594059405}]
[{"$f":"+[1]a1_ind!AM30","v":0},{"$f":"+[1]a1_ind!AN30","v":0},null,null,null,null,"Participación de las películas nacionales en el total de asistencia en Colombia"]
[null,null,null,null,null,null,"1996 – Junio  2011"]
[]
[]
[]
[]
[]
[]
[]
[]
[]
[]
[]
[]
[]
[]
[]
[]
[]
[]
[]
[]
[]
[]
[]
[]
[]
[]
[]
[]
[]
[]
[]
[null,null,null,null,null,null,"Participación de las películas nacionales en el total de estrenos y asistencia en Colombia"]
[null,null,null,null,null,null,"1996 – Junio  2011"]

{"sheet":"Ind de Asistencia a Cine en Col","index":2,"n_rows":26,"n_cols":4,"rows_kept":26,"cut":false,"hidden":false,"merged":[]}
[null,{"$f":"+[1]a1_ind!AP6","v":"Indice de asistencia"}]
[{"$f":"+[1]a1_ind!AM7","v":1990},{"$f":"+[1]a1_ind!AP7","v":0.7735125397809588}]
[{"$f":"+[1]a1_ind!AM8","v":1991},{"$f":"+[1]a1_ind!AP8","v":0.72350237162354791}]
[{"$f":"+[1]a1_ind!AM9","v":1992},{"$f":"+[1]a1_ind!AP9","v":0.52645003200928808}]
[{"$f":"+[1]a1_ind!AM10","v":1993},{"$f":"+[1]a1_ind!AP10","v":0.48609239931562609}]
[{"$f":"+[1]a1_ind!AM11","v":1994},{"$f":"+[1]a1_ind!AP11","v":0.47484791638769352}]
[{"$f":"+[1]a1_ind!AM12","v":1995},{"$f":"+[1]a1_ind!AP12","v":0.46701307828761729}]
[{"$f":"+[1]a1_ind!AM13","v":1996},{"$f":"+[1]a1_ind!AP13","v":0.47415089556728018}]
[{"$f":"+[1]a1_ind!AM14","v":1997},{"$f":"+[1]a1_ind!AP14","v":0.46200804328826423}]
[{"$f":"+[1]a1_ind!AM15","v":1998},{"$f":"+[1]a1_ind!AP15","v":0.46829793936656922}]
[{"$f":"+[1]a1_ind!AM16","v":1999},{"$f":"+[1]a1_ind!AP16","v":0.40245856627395199}]
[{"$f":"+[1]a1_ind!AM17","v":2000},{"$f":"+[1]a1_ind!AP17","v":0.42684600287133351}]
[{"$f":"+[1]a1_ind!AM18","v":2001},{"$f":"+[1]a1_ind!AP18","v":0.43608076054954409}]
[{"$f":"+[1]a1_ind!AM19","v":2002},{"$f":"+[1]a1_ind!AP19","v":0.44518566509417251}]
[{"$f":"+[1]a1_ind!AM20","v":2003},{"$f":"+[1]a1_ind!AP20","v":0.40827777818798311}]
[{"$f":"+[1]a1_ind!AM21","v":2004},{"$f":"+[1]a1_ind!AP21","v":0.40412109103064781}]
[{"$f":"+[1]a1_ind!AM22","v":2005},{"$f":"+[1]a1_ind!AP22","v":0.37166060382677052}]
[{"$f":"+[1]a1_ind!AM23","v":2006},{"$f":"+[1]a1_ind!AP23","v":0.46575668094949918}]
[{"$f":"+[1]a1_ind!AM24","v":2007},{"$f":"+[1]a1_ind!AP24","v":0.47053045752413059}]
[{"$f":"+[1]a1_ind!AM25","v":2008},{"$f":"+[1]a1_ind!AP25","v":0.48509157705199374}]
[{"$f":"+[1]a1_ind!AM26","v":2009},{"$f":"+[1]a1_ind!AP26","v":0.60178719180613671}]
[{"$f":"+[1]a1_ind!AM27","v":2010},{"$f":"+[1]a1_ind!AP27","v":0.73951655985253573}]
[{"$f":"+[1]a1_ind!AM29","v":"2011*"},{"$f":"+[1]a1_ind!AP29","v":0.8273670565632657}]
[]
[null,null,null,"Índice de asistencia a cine en Colombia"]
[null,null,null,"1996 – 2011*"]

{"sheet":"Taquilla en Colombia","index":3,"n_rows":31,"n_cols":10,"rows_kept":31,"cut":false,"hidden":false,"merged":[]}
[null,{"$f":"+[1]a1_ind!AH5","v":"Taquilla Nominal"},null,{"$f":"+[1]a1_ind!AJ5","v":"Real"},{"$f":"+[1]a1_ind!AK5","v":"Real"}]
[null,{"$f":"+[1]a1_ind!AH6","v":"COP"},{"$f":"+[1]a1_ind!AI6","v":"USD"},{"$f":"+[1]a1_ind!AJ6","v":"COP"},{"$f":"+[1]a1_ind!AK6","v":"USD"}]
[{"$f":"+[1]a1_ind!AG7","v":1990},{"$f":"+[1]a1_ind!AH7","v":11171000000},{"$f":"+[1]a1_ind!AI7","v":22241468.562099315},{"$f":"+[1]a1_ind!AJ7","v":123625733333.33333},{"$f":"+[1]a1_ind!AK7","v":67245215.351128086}]
[{"$f":"+[1]a1_ind!AG8","v":1991},{"$f":"+[1]a1_ind!AH8","v":14476000000},{"$f":"+[1]a1_ind!AI8","v":23082105.229589295},{"$f":"+[1]a1_ind!AJ8","v":122219123630.67294},{"$f":"+[1]a1_ind!AK8","v":66480101.40745306}]
[{"$f":"+[1]a1_ind!AG9","v":1992},{"$f":"+[1]a1_ind!AH9","v":14444000000},{"$f":"+[1]a1_ind!AI9","v":21229131.020021729},{"$f":"+[1]a1_ind!AJ9","v":95205106902.871109},{"$f":"+[1]a1_ind!AK9","v":51786046.024485245}]
[{"$f":"+[1]a1_ind!AG10","v":1993},{"$f":"+[1]a1_ind!AH10","v":20077000000},{"$f":"+[1]a1_ind!AI10","v":25531996.066196419},{"$f":"+[1]a1_ind!AJ10","v":109024071464.51936},{"$f":"+[1]a1_ind!AK10","v":59302759.76054918}]
[{"$f":"+[1]a1_ind!AG11","v":1994},{"$f":"+[1]a1_ind!AH11","v":28384000000},{"$f":"+[1]a1_ind!AI11","v":34340745.759430885},{"$f":"+[1]a1_ind!AJ11","v":125209877350.77678},{"$f":"+[1]a1_ind!AK11","v":68106897.645970047},null,null,"Taquilla del mercado cinematográfico en Colombia"]
[{"$f":"+[1]a1_ind!AG12","v":1995},{"$f":"+[1]a1_ind!AH12","v":33570000000},{"$f":"+[1]a1_ind!AI12","v":36773122.867361523},{"$f":"+[1]a1_ind!AJ12","v":121713810483.87099},{"$f":"+[1]a1_ind!AK12","v":66205240.418076091},null,null,"1996 – Junio 2011"]
[{"$f":"+[1]a1_ind!AG13","v":1996},{"$f":"+[1]a1_ind!AH13","v":41994000000},{"$f":"+[1]a1_ind!AI13","v":40510407.597751342},{"$f":"+[1]a1_ind!AJ13","v":127208102189.78104},{"$f":"+[1]a1_ind!AK13","v":69193815.846540049}]
[{"$f":"+[1]a1_ind!AG14","v":1997},{"$f":"+[1]a1_ind!AH14","v":53690000000},{"$f":"+[1]a1_ind!AI14","v":47050403.844187707},{"$f":"+[1]a1_ind!AJ14","v":137018708609.27153},{"$f":"+[1]a1_ind!AK14","v":74530215.668937847}]
[{"$f":"+[1]a1_ind!AG15","v":1998},{"$f":"+[1]a1_ind!AH15","v":62392000000},{"$f":"+[1]a1_ind!AI15","v":43740145.083071947},{"$f":"+[1]a1_ind!AJ15","v":131924295512.44366},{"$f":"+[1]a1_ind!AK15","v":71759150.967868626},null,null,null,null,"Taquilla pesos (terminos reales)"]
[{"$f":"+[1]a1_ind!AG16","v":1999},{"$f":"+[1]a1_ind!AH16","v":62576000000},{"$f":"+[1]a1_ind!AI16","v":35621622.724230245},{"$f":"+[1]a1_ind!AJ16","v":121437956834.53238},{"$f":"+[1]a1_ind!AK16","v":66055192.062001608}]
[{"$f":"+[1]a1_ind!AG17","v":2000},{"$f":"+[1]a1_ind!AH17","v":75765000000},{"$f":"+[1]a1_ind!AI17","v":36287338.824714564},{"$f":"+[1]a1_ind!AJ17","v":134061061003.60777},{"$f":"+[1]a1_ind!AK17","v":72921427.232962757}]
[{"$f":"+[1]a1_ind!AG18","v":2001},{"$f":"+[1]a1_ind!AH18","v":92216000000},{"$f":"+[1]a1_ind!AI18","v":40095772.55756788},{"$f":"+[1]a1_ind!AJ18","v":151171473716.19571},{"$f":"+[1]a1_ind!AK18","v":82228497.505316973}]
[{"$f":"+[1]a1_ind!AG19","v":2002},{"$f":"+[1]a1_ind!AH19","v":111482000000},{"$f":"+[1]a1_ind!AI19","v":44509463.447937645},{"$f":"+[1]a1_ind!AJ19","v":172013553553.55356},{"$f":"+[1]a1_ind!AK19","v":93565377.855701402}]
[{"$f":"+[1]a1_ind!AG20","v":2003},{"$f":"+[1]a1_ind!AH20","v":114183000000},{"$f":"+[1]a1_ind!AI20","v":39680723.024153709},{"$f":"+[1]a1_ind!AJ20","v":164337010804.32175},{"$f":"+[1]a1_ind!AK20","v":89389784.664821237}]
[{"$f":"+[1]a1_ind!AG21","v":2004},{"$f":"+[1]a1_ind!AH21","v":127673000000},{"$f":"+[1]a1_ind!AI21","v":48575003.122976802},{"$f":"+[1]a1_ind!AJ21","v":173238389084.50705},{"$f":"+[1]a1_ind!AK21","v":94231617.21241042}]
[{"$f":"+[1]a1_ind!AG22","v":2005},{"$f":"+[1]a1_ind!AH22","v":121095000000},{"$f":"+[1]a1_ind!AI22","v":52170672.495241188},{"$f":"+[1]a1_ind!AJ22","v":156743648032.62958},{"$f":"+[1]a1_ind!AK22","v":85259436.548342153}]
[{"$f":"+[1]a1_ind!AG23","v":2006},{"$f":"+[1]a1_ind!AH23","v":138432000000},{"$f":"+[1]a1_ind!AI23","v":58692569.093040563},{"$f":"+[1]a1_ind!AJ23","v":172400886426.5928},{"$f":"+[1]a1_ind!AK23","v":93776064.431690127}]
[{"$f":"+[1]a1_ind!AG24","v":2007},{"$f":"+[1]a1_ind!AH24","v":148725883903},{"$f":"+[1]a1_ind!AI24","v":71578163.669695631},{"$f":"+[1]a1_ind!AJ24","v":174676421825.77228},{"$f":"+[1]a1_ind!AK24","v":95013823.463172302}]
[{"$f":"+[1]a1_ind!AG25","v":2008},{"$f":"+[1]a1_ind!AH25","v":159980785142},{"$f":"+[1]a1_ind!AI25","v":81409461.24227947},{"$f":"+[1]a1_ind!AJ25","v":175301378255.52759},{"$f":"+[1]a1_ind!AK25","v":95353763.446303919}]
[{"$f":"+[1]a1_ind!AG26","v":2009},{"$f":"+[1]a1_ind!AH26","v":198078594887},{"$f":"+[1]a1_ind!AI26","v":91805129.725412279},{"$f":"+[1]a1_ind!AJ26","v":209085114344.62241},{"$f":"+[1]a1_ind!AK26","v":113730152.79035251}]
[{"$f":"+[1]a1_ind!AG27","v":2010},{"$f":"+[1]a1_ind!AH27","v":258087337650},{"$f":"+[1]a1_ind!AI27","v":135907149.77244571},{"$f":"+[1]a1_ind!AJ27","v":266433445583.95523},{"$f":"+[1]a1_ind!AK27","v":144924312.61643589}]
[{"$f":"+[1]a1_ind!AG28","v":"2010*"},{"$f":"+[1]a1_ind!AH28","v":125405116168},{"$f":"+[1]a1_ind!AI28","v":64360924.573852949},{"$f":"+[1]a1_ind!AJ28","v":129460505496.81593},{"$f":"+[1]a1_ind!AK28","v":70418992.364043593}]
[{"$f":"+[1]a1_ind!AG29","v":"2011*"},{"$f":"+[1]a1_ind!AH29","v":148687077453},{"$f":"+[1]a1_ind!AI29","v":80877130.30019246},{"$f":"+[1]a1_ind!AJ29","v":148687077453},{"$f":"+[1]a1_ind!AK29","v":80877130.30019246}]
[]
[]
[]
[null,null,null,{"$f":"+D23*100/D18-100","v":69.980378106608413}]
[]
[null,{"$f":"+B25/B24-100%","v":0.18565399878749855},{"$f":"+C25/C24-100%","v":0.25661852802296958},0.14851303015078177,0.14851303015078154]

{"sheet":"Estrenos de películas Col.","index":4,"n_rows":56,"n_cols":10,"rows_kept":56,"cut":false,"hidden":false,"merged":[[0,3,0,4]]}
[{"$f":"+[1]a3_ind!X7","v":"CIFRA OFICIAL"},{"$f":"+[1]a3_ind!Y7","v":"Total estrenos"},{"$f":"+[1]a3_ind!Z7","v":"Estrenos colombianos"},{"$f":"+[1]a3_ind!AA7","v":"% cine colombiano en total estrenos"},null,null,null,null,null,"Estrenos totales (nacionales + extranjeros)"]
[{"$f":"+[1]a3_ind!X8","v":1993},{"$f":"+[1]a3_ind!Y8","v":276}]
[{"$f":"+[1]a3_ind!X9","v":1994},{"$f":"+[1]a3_ind!Y9","v":268}]
[{"$f":"+[1]a3_ind!X10","v":1995},{"$f":"+[1]a3_ind!Y10","v":250}]
[{"$f":"+[1]a3_ind!X11","v":1996},{"$f":"+[1]a3_ind!Y11","v":273},{"$f":"+[1]a3_ind!Z11","v":3},{"$f":"+[1]a3_ind!AA11","v":1.098901098901099}]
[{"$f":"+[1]a3_ind!X12","v":1997},{"$f":"+[1]a3_ind!Y12","v":252},{"$f":"+[1]a3_ind!Z12","v":1},{"$f":"+[1]a3_ind!AA12","v":0.3968253968253968},null,"Estrenos cinematográficos en Colombia"]
[{"$f":"+[1]a3_ind!X13","v":1998},{"$f":"+[1]a3_ind!Y13","v":241},{"$f":"+[1]a3_ind!Z13","v":4},{"$f":"+[1]a3_ind!AA13","v":1.6597510373443984},null,"1996 – Junio 2011"]
[{"$f":"+[1]a3_ind!X14","v":1999},{"$f":"+[1]a3_ind!Y14","v":246},{"$f":"+[1]a3_ind!Z14","v":3},{"$f":"+[1]a3_ind!AA14","v":1.2195121951219512}]
[{"$f":"+[1]a3_ind!X15","v":2000},{"$f":"+[1]a3_ind!Y15","v":204},{"$f":"+[1]a3_ind!Z15","v":4},{"$f":"+[1]a3_ind!AA15","v":1.9607843137254901}]
[{"$f":"+[1]a3_ind!X16","v":2001},{"$f":"+[1]a3_ind!Y16","v":203},{"$f":"+[1]a3_ind!Z16","v":7},{"$f":"+[1]a3_ind!AA16","v":3.4482758620689653}]
[{"$f":"+[1]a3_ind!X17","v":2002},{"$f":"+[1]a3_ind!Y17","v":180},{"$f":"+[1]a3_ind!Z17","v":4},{"$f":"+[1]a3_ind!AA17","v":2.2222222222222223}]
[{"$f":"+[1]a3_ind!X18","v":2003},{"$f":"+[1]a3_ind!Y18","v":175},{"$f":"+[1]a3_ind!Z18","v":5},{"$f":"+[1]a3_ind!AA18","v":2.8571428571428572}]
[{"$f":"+[1]a3_ind!X19","v":2004},{"$f":"+[1]a3_ind!Y19","v":167},{"$f":"+[1]a3_ind!Z19","v":8},{"$f":"+[1]a3_ind!AA19","v":4.7904191616766472}]
[{"$f":"+[1]a3_ind!X20","v":2005},{"$f":"+[1]a3_ind!Y20","v":164},{"$f":"+[1]a3_ind!Z20","v":8},{"$f":"+[1]a3_ind!AA20","v":4.8780487804878048}]
[{"$f":"+[1]a3_ind!X21","v":2006},{"$f":"+[1]a3_ind!Y21","v":162},{"$f":"+[1]a3_ind!Z21","v":8},{"$f":"+[1]a3_ind!AA21","v":4.9382716049382713}]
[{"$f":"+[1]a3_ind!X22","v":2007},{"$f":"+[1]a3_ind!Y22","v":198},{"$f":"+[1]a3_ind!Z22","v":10},{"$f":"+[1]a3_ind!AA22","v":5.0505050505050502}]
[{"$f":"+[1]a3_ind!X23","v":2008},{"$f":"+[1]a3_ind!Y23","v":200},{"$f":"+[1]a3_ind!Z23","v":13},{"$f":"+[1]a3_ind!AA23","v":6.5}]
[{"$f":"+[1]a3_ind!X24","v":2009},{"$f":"+[1]a3_ind!Y24","v":214},{"$f":"+[1]a3_ind!Z24","v":12},{"$f":"+[1]a3_ind!AA24","v":5.6074766355140184}]
[{"$f":"+[1]a3_ind!X25","v":2010},{"$f":"+[1]a3_ind!Y25","v":207},{"$f":"+[1]a3_ind!Z25","v":10},{"$f":"+[1]a3_ind!AA25","v":4.8309178743961354}]
[{"$f":"+[1]a3_ind!X26","v":"2010*"},{"$f":"+[1]a3_ind!Y26","v":105},{"$f":"+[1]a3_ind!Z26","v":5},{"$f":"+[1]a3_ind!AA26","v":4.7619047619047619}]
[{"$f":"+[1]a3_ind!X27","v":"2011*"},{"$f":"+[1]a3_ind!Y27","v":101},{"$f":"+[1]a3_ind!Z27","v":6},{"$f":"+[1]a3_ind!AA27","v":5.9405940594059405}]
[]
[]
[]
[]
[null,{"$f":"360/7","v":51.428571428571431}]
[null,{"$f":"253/52","v":4.865384615384615},null,null,null,null,null,null,"a4","Estrenos (nacionales)"]
[]
[null,{"$f":"101/26","v":3.8846153846153846}]
[null,null,null,null,null,"Estreno de películas colombianas"]
[null,null,null,null,null,"1996 – Junio 2011"]
[]
[]
[]
[]
[]
[]
[]
[]
[]
[]
[]
[]
[]
[]
[]
[]
[]
[]
[]
[]
[null,null,null,null,null,null,null,null,"a4_2","Porcentaje de estrenos colombianos en total de estrenos"]
[]
[]
[null,null,null,null,null,"Participación de las películas nacionales en el total de estrenos en Colombia"]
[null,null,null,null,null,"1996 – Junio  2011"]

{"sheet":"Asistencia a películas Col.","index":5,"n_rows":22,"n_cols":11,"rows_kept":22,"cut":false,"hidden":false,"merged":[]}
[null,null,null,null,null,null,null,null,null,"a5","Espectadores peliculas colombianas"]
[null,{"$f":"+[1]a5_ind!AH2","v":"Películas colombianas"}]
[null,{"$f":"+[1]a5_ind!AH3","v":"Espectatores"},null,{"$f":"+[1]a1_ind!AZ10","v":"% cine Colombiano"}]
[{"$f":"+[1]a5_ind!AG4","v":1996},{"$f":"+[1]a5_ind!AH4","v":987000}]
[{"$f":"+[1]a5_ind!AG5","v":1997},{"$f":"+[1]a5_ind!AH5","v":100000}]
[{"$f":"+[1]a5_ind!AG6","v":1998},{"$f":"+[1]a5_ind!AH6","v":1422000},null,{"$f":"+[1]a1_ind!AZ13","v":1996},null,null,"Asistencia a películas colombianas"]
[{"$f":"+[1]a5_ind!AG7","v":1999},{"$f":"+[1]a5_ind!AH7","v":112000},null,{"$f":"+[1]a1_ind!AZ14","v":1997},null,null,"1996 – Junio 2011"]
[{"$f":"+[1]a5_ind!AG8","v":2000},{"$f":"+[1]a5_ind!AH8","v":618000},null,{"$f":"+[1]a1_ind!AZ15","v":1998}]
[{"$f":"+[1]a5_ind!AG9","v":2001},{"$f":"+[1]a5_ind!AH9","v":84000},null,{"$f":"+[1]a1_ind!AZ16","v":1999}]
[{"$f":"+[1]a5_ind!AG10","v":2002},{"$f":"+[1]a5_ind!AH10","v":854541},null,{"$f":"+[1]a1_ind!AZ17","v":2000}]
[{"$f":"+[1]a5_ind!AG11","v":2003},{"$f":"+[1]a5_ind!AH11","v":577304},null,{"$f":"+[1]a1_ind!AZ18","v":2001}]
[{"$f":"+[1]a5_ind!AG12","v":2004},{"$f":"+[1]a5_ind!AH12","v":944700},null,{"$f":"+[1]a1_ind!AZ19","v":2002}]
[{"$f":"+[1]a5_ind!AG13","v":2005},{"$f":"+[1]a5_ind!AH13","v":1979106},null,{"$f":"+[1]a1_ind!AZ20","v":2003}]
[{"$f":"+[1]a5_ind!AG14","v":2006},{"$f":"+[1]a5_ind!AH14","v":2806892},null,{"$f":"+[1]a1_ind!AZ21","v":2004}]
[{"$f":"+[1]a5_ind!AG15","v":2007},{"$f":"+[1]a5_ind!AH15","v":2387135},null,{"$f":"+[1]a1_ind!AZ22","v":2005}]
[{"$f":"+[1]a5_ind!AG16","v":2008},{"$f":"+[1]a5_ind!AH16","v":2278429},null,{"$f":"+[1]a1_ind!AZ23","v":2006}]
[{"$f":"+[1]a5_ind!AG17","v":2009},{"$f":"+[1]a5_ind!AH17","v":1208280},null,{"$f":"+[1]a1_ind!AZ24","v":2007}]
[{"$f":"+[1]a5_ind!AG18","v":2010},{"$f":"+[1]a5_ind!AH18","v":1530700},null,{"$f":"+[1]a1_ind!AZ25","v":2008}]
[{"$f":"+[1]a5_ind!AG19","v":"2010*"},{"$f":"+[1]a5_ind!AH19","v":767323},null,{"$f":"+[1]a1_ind!AZ26","v":2009}]
[{"$f":"+[1]a5_ind!AG20","v":"2011*"},{"$f":"+[1]a5_ind!AH20","v":2176843},null,{"$f":"+[1]a1_ind!AZ27","v":2010}]
[null,null,null,{"$f":"+[1]a1_ind!AZ28","v":"2010*"}]
[null,{"$f":"+B20/B19-100%","v":1.8369317744939222},null,{"$f":"+[1]a1_ind!AZ29","v":"2011*"}]

{"sheet":"5 más taquilleras en Colombia","index":6,"n_rows":30,"n_cols":15,"rows_kept":30,"cut":false,"hidden":false,"merged":[[0,13,1,13],[0,12,1,12],[0,10,1,10],[0,11,1,11],[22,10,26,10],[17,10,21,10],[12,10,16,10],[7,10,11,10],[2,10,6,10]]}
[null,null,null,null,{"$f":"+[1]a12_ind!L9","v":"TAQUILLA"},null,null,{"$f":"+[1]a12_ind!Q9","v":0},null,null,"Año ","Ranking","Película","Asistencia","Taquilla"]
[{"$f":"+[1]a12_ind!H10","v":"AÑO"},{"$f":"+[1]a12_ind!I10","v":"RANKING"},{"$f":"+[1]a12_ind!J10","v":"PELICULA"},{"$f":"+[1]a12_ind!K10","v":"ESPECTADORES"},{"$f":"+[1]a12_ind!L10","v":"Millones corrientes"},{"$f":"+[1]a12_ind!M10","v":"COP Constantes"},null,{"$f":"+[1]a12_ind!Q10","v":"SI ES COLOMBIANA 1"},null,null,"Año ",null,"Película",null,"$ Constantes (base junio 2011)"]
[{"$f":"+[1]a12_ind!H11","v":2007},{"$f":"+[1]a12_ind!I11","v":1},{"$f":"+[1]a12_ind!J11","v":"SHREK 3"},{"$f":"+[1]a12_ind!K11","v":1102298},{"$f":"+[1]a12_ind!L11","v":7742.6756240000004},{"$f":"+[1]a12_ind!M11","v":9093.661694019811},null,{"$f":"+[1]a12_ind!Q11","v":0},null,null,2007,1,"Shrek 3",1102298,9093.661694019811]
[{"$f":"+[1]a12_ind!H12","v":0},{"$f":"+[1]a12_ind!I12","v":2},{"$f":"+[1]a12_ind!J12","v":"SPIDER MAN 3"},{"$f":"+[1]a12_ind!K12","v":1043491},{"$f":"+[1]a12_ind!L12","v":7407.0583999999999},{"$f":"+[1]a12_ind!M12","v":8699.4840683574621},null,{"$f":"+[1]a12_ind!Q12","v":0},null,null,null,2,"Spider man 3",1043491,8699.4840683574621]
[{"$f":"+[1]a12_ind!H13","v":0},{"$f":"+[1]a12_ind!I13","v":3},{"$f":"+[1]a12_ind!J13","v":"THE SIMPSON MOVIE"},{"$f":"+[1]a12_ind!K13","v":1015204},{"$f":"+[1]a12_ind!L13","v":7204.1799810000002},{"$f":"+[1]a12_ind!M13","v":8461.206269183629},null,{"$f":"+[1]a12_ind!Q13","v":0},null,null,null,3,"The simpson movie",1015204,8461.206269183629]
[{"$f":"+[1]a12_ind!H14","v":0},{"$f":"+[1]a12_ind!I14","v":4},{"$f":"+[1]a12_ind!J14","v":"A NIGHT AT THE MUSEUM"},{"$f":"+[1]a12_ind!K14","v":884838},{"$f":"+[1]a12_ind!L14","v":6298.0568000000003},{"$f":"+[1]a12_ind!M14","v":7396.9775630782633},null,{"$f":"+[1]a12_ind!Q14","v":0},null,null,null,4,"A night at the museum",884838,7396.9775630782633]
[{"$f":"+[1]a12_ind!H15","v":0},{"$f":"+[1]a12_ind!I15","v":5},{"$f":"+[1]a12_ind!J15","v":"PIRATES OF THE CARIBBEAN 3"},{"$f":"+[1]a12_ind!K15","v":833621},{"$f":"+[1]a12_ind!L15","v":5986.2072749999998},{"$f":"+[1]a12_ind!M15","v":7030.7147596876021},null,{"$f":"+[1]a12_ind!Q15","v":0},null,null,null,5,"Pirates of the caribbean 3",833621,7030.7147596876021]
[{"$f":"+[1]a12_ind!H16","v":2008},{"$f":"+[1]a12_ind!I16","v":1},{"$f":"+[1]a12_ind!J16","v":"PARAISO TRAVEL"},{"$f":"+[1]a12_ind!K16","v":931245},{"$f":"+[1]a12_ind!L16","v":7285.5783469999997},{"$f":"+[1]a12_ind!M16","v":7983.2832704508992},null,{"$f":"+[1]a12_ind!Q16","v":1},null,null,2008,1,"Paraíso travel**",931245,7983.2832704508992]
[{"$f":"+[1]a12_ind!H17","v":0},{"$f":"+[1]a12_ind!I17","v":2},{"$f":"+[1]a12_ind!J17","v":"THE DARK KNIGHT"},{"$f":"+[1]a12_ind!K17","v":944789},{"$f":"+[1]a12_ind!L17","v":7093.4131950000001},{"$f":"+[1]a12_ind!M17","v":7772.7153827612483},null,{"$f":"+[1]a12_ind!Q17","v":0},null,null,null,2,"The dark knight",944789,7772.7153827612483]
[{"$f":"+[1]a12_ind!H18","v":0},{"$f":"+[1]a12_ind!I18","v":3},{"$f":"+[1]a12_ind!J18","v":"KUNG FU PANDA"},{"$f":"+[1]a12_ind!K18","v":827091},{"$f":"+[1]a12_ind!L18","v":5764.0348690000001},{"$f":"+[1]a12_ind!M18","v":6316.0288652899371},null,{"$f":"+[1]a12_ind!Q18","v":0},null,null,null,3,"Kung fu panda",827091,6316.0288652899371]
[{"$f":"+[1]a12_ind!H19","v":0},{"$f":"+[1]a12_ind!I19","v":4},{"$f":"+[1]a12_ind!J19","v":"WALL-E"},{"$f":"+[1]a12_ind!K19","v":818733},{"$f":"+[1]a12_ind!L19","v":5736.3337389999997},{"$f":"+[1]a12_ind!M19","v":6285.6749308225862},null,{"$f":"+[1]a12_ind!Q19","v":0},null,null,null,4,"Wall-e",818733,6285.6749308225862]
[{"$f":"+[1]a12_ind!H20","v":0},{"$f":"+[1]a12_ind!I20","v":5},{"$f":"+[1]a12_ind!J20","v":"MADAGASCAR 2"},{"$f":"+[1]a12_ind!K20","v":765749},{"$f":"+[1]a12_ind!L20","v":5376.9500099999996},{"$f":"+[1]a12_ind!M20","v":5891.8747443789989},null,{"$f":"+[1]a12_ind!Q20","v":0},null,null,null,5,"Madagascar 2",765749,5891.8747443789989]
[{"$f":"+[1]a12_ind!H21","v":2009},{"$f":"+[1]a12_ind!I21","v":1},{"$f":"+[1]a12_ind!J21","v":"ICE AGE 3"},{"$f":"+[1]a12_ind!K21","v":2035362},{"$f":"+[1]a12_ind!L21","v":16088.907438},{"$f":"+[1]a12_ind!M21","v":16982.910512230486},null,{"$f":"+[1]a12_ind!Q21","v":0},null,null,2009,1,"Ice age 3",2035362,16982.910512230486]
[{"$f":"+[1]a12_ind!H22","v":0},{"$f":"+[1]a12_ind!I22","v":2},{"$f":"+[1]a12_ind!J22","v":"UP"},{"$f":"+[1]a12_ind!K22","v":1222254},{"$f":"+[1]a12_ind!L22","v":10267.445983},{"$f":"+[1]a12_ind!M22","v":10837.971253822148},null,{"$f":"+[1]a12_ind!Q22","v":0},null,null,null,2,"Up",1222254,10837.971253822148]
[{"$f":"+[1]a12_ind!H23","v":0},{"$f":"+[1]a12_ind!I23","v":3},{"$f":"+[1]a12_ind!J23","v":"2012"},{"$f":"+[1]a12_ind!K23","v":1335566},{"$f":"+[1]a12_ind!L23","v":8249.1661820000008},{"$f":"+[1]a12_ind!M23","v":8707.5428589101957},null,{"$f":"+[1]a12_ind!Q23","v":0},null,null,null,3,2012,1335566,8707.5428589101957]
[{"$f":"+[1]a12_ind!H24","v":0},{"$f":"+[1]a12_ind!I24","v":4},{"$f":"+[1]a12_ind!J24","v":"AVATAR"},{"$f":"+[1]a12_ind!K24","v":921576},{"$f":"+[1]a12_ind!L24","v":7776.031849},{"$f":"+[1]a12_ind!M24","v":8208.1181423116814},null,{"$f":"+[1]a12_ind!Q24","v":0},null,null,null,4,"Avatar",921576,8208.1181423116814]
[{"$f":"+[1]a12_ind!H25","v":0},{"$f":"+[1]a12_ind!I25","v":5},{"$f":"+[1]a12_ind!J25","v":"ANGELS & DEMONS"},{"$f":"+[1]a12_ind!K25","v":824141},{"$f":"+[1]a12_ind!L25","v":6004.1502099999998},{"$f":"+[1]a12_ind!M25","v":6337.7793744766195},null,{"$f":"+[1]a12_ind!Q25","v":0},null,null,null,5,"Angels & demons",824141,6337.7793744766195]
[{"$f":"+[1]a12_ind!H26","v":2010},{"$f":"+[1]a12_ind!I26","v":1},{"$f":"+[1]a12_ind!J26","v":"TOY STORY 3 3D"},{"$f":"+[1]a12_ind!K26","v":2156531},{"$f":"+[1]a12_ind!L26","v":19308.815954999998},{"$f":"+[1]a12_ind!M26","v":19933.230401305969},null,{"$f":"+[1]a12_ind!Q26","v":0},null,null,2010,1,"Toy Story 3 - 3D",2156531,19933.230401305969]
[{"$f":"+[1]a12_ind!H27","v":0},{"$f":"+[1]a12_ind!I27","v":2},{"$f":"+[1]a12_ind!J27","v":"AVATAR"},{"$f":"+[1]a12_ind!K27","v":1838589},{"$f":"+[1]a12_ind!L27","v":19084.62544},{"$f":"+[1]a12_ind!M27","v":19701.789944278607},null,{"$f":"+[1]a12_ind!Q27","v":0},null,null,null,2,"Avatar",1838589,19701.789944278607]
[{"$f":"+[1]a12_ind!H28","v":0},{"$f":"+[1]a12_ind!I28","v":3},{"$f":"+[1]a12_ind!J28","v":"ALICE IN WONDERLAND"},{"$f":"+[1]a12_ind!K28","v":1517848},{"$f":"+[1]a12_ind!L28","v":13350.738267000001},{"$f":"+[1]a12_ind!M28","v":13782.478559216419},null,{"$f":"+[1]a12_ind!Q28","v":0},null,null,null,3,"Alice in wonderland",1517848,13782.478559216419]
[{"$f":"+[1]a12_ind!H29","v":0},{"$f":"+[1]a12_ind!I29","v":4},{"$f":"+[1]a12_ind!J29","v":"SHREK FOREVER AFTER 3D"},{"$f":"+[1]a12_ind!K29","v":1392201},{"$f":"+[1]a12_ind!L29","v":12303.367061000001},{"$f":"+[1]a12_ind!M29","v":12701.237140087067},null,{"$f":"+[1]a12_ind!Q29","v":0},null,null,null,4,"Shrek forever after - 3D",1392201,12701.237140087067]
[{"$f":"+[1]a12_ind!H30","v":0},{"$f":"+[1]a12_ind!I30","v":5},{"$f":"+[1]a12_ind!J30","v":"CLASH OF THE TITANS 3D"},{"$f":"+[1]a12_ind!K30","v":1198732},{"$f":"+[1]a12_ind!L30","v":11035.388564999999},{"$f":"+[1]a12_ind!M30","v":11392.254364365672},null,{"$f":"+[1]a12_ind!Q30","v":0},null,null,null,5,"Clash of the titans -3D",1198732,11392.254364365672]
[{"$f":"+[1]a12_ind!H31","v":"2011*"},{"$f":"+[1]a12_ind!I31","v":1},{"$f":"+[1]a12_ind!J31","v":"RIO 3D"},{"$f":"+[1]a12_ind!K31","v":1723577},{"$f":"+[1]a12_ind!L31","v":15003.076944},{"$f":"+[1]a12_ind!M31","v":15003.076944},null,{"$f":"+[1]a12_ind!Q31","v":0},null,null,"Ene-Jun\n 2011",1,"Rio - 3D",1723577,15003.076944]
[{"$f":"+[1]a12_ind!H32","v":0},{"$f":"+[1]a12_ind!I32","v":2},{"$f":"+[1]a12_ind!J32","v":"PIRATES OF CARIBBEAN ON STRANGER TIDES3D"},{"$f":"+[1]a12_ind!K32","v":1391949},{"$f":"+[1]a12_ind!L32","v":12488.739524000001},{"$f":"+[1]a12_ind!M32","v":12488.739524000001},null,{"$f":"+[1]a12_ind!Q32","v":0},null,null,null,2,"Pirates of caribbean on stranger tides - 3D ",1391949,12488.739524000001]
[{"$f":"+[1]a12_ind!H33","v":0},{"$f":"+[1]a12_ind!I33","v":3},{"$f":"+[1]a12_ind!J33","v":"TANGLED - RAPUNZEL 3D"},{"$f":"+[1]a12_ind!K33","v":1123812},{"$f":"+[1]a12_ind!L33","v":9943.7751700000008},{"$f":"+[1]a12_ind!M33","v":9943.7751700000008},null,{"$f":"+[1]a12_ind!Q33","v":0},null,null,null,3,"Tangled - Rapunzel - 3D",1123812,9943.7751700000008]
[{"$f":"+[1]a12_ind!H34","v":0},{"$f":"+[1]a12_ind!I34","v":4},{"$f":"+[1]a12_ind!J34","v":"KUNG FU PANDA 2 3D"},{"$f":"+[1]a12_ind!K34","v":1073195},{"$f":"+[1]a12_ind!L34","v":8733.8175339999998},{"$f":"+[1]a12_ind!M34","v":8733.8175339999998},null,{"$f":"+[1]a12_ind!Q34","v":0},null,null,null,4,"Kung fu panda 2 - 3D",1073195,8733.8175339999998]
[{"$f":"+[1]a12_ind!H35","v":0},{"$f":"+[1]a12_ind!I35","v":5},{"$f":"+[1]a12_ind!J35","v":"EL PASEO"},{"$f":"+[1]a12_ind!K35","v":1189607},{"$f":"+[1]a12_ind!L35","v":7949.1236660000004},{"$f":"+[1]a12_ind!M35","v":7949.1236660000004},null,{"$f":"+[1]a12_ind!Q35","v":1},null,null,null,5,"El paseo**",1189607,7949.1236660000004]
[]
[null,null,null,null,null,null,null,null,null,null,"Las cinco películas más taquilleras por año en Colombia"]
[null,null,null,null,null,null,null,null,null,null,"2007 – Junio  2011"]

{"sheet":"5 más taquilleras Colombianas","index":7,"n_rows":31,"n_cols":16,"rows_kept":31,"cut":false,"hidden":false,"merged":[[1,10,2,10],[1,9,2,9],[1,14,2,14],[1,11,2,11],[3,13,7,13],[1,12,2,13],[23,13,27,13],[18,9,22,9],[23,9,27,9],[3,9,7,9],[8,9,12,9],[13,9,17,9],[8,13,12,13],[13,13,17,13],[18,13,22,13]]}
[]
["Año",{"$f":"+[1]a13_ind!O9","v":"PELICULA"},{"$f":"+[1]a13_ind!P9","v":"POSICIÓN EN RANKING GENERAL"},{"$f":"+[1]a13_ind!Q9","v":"ESPECTADORES"},{"$f":"+[1]a13_ind!R9","v":"TAQUILLA"},null,null,null,null,"Año","Ranking","Película","Posición en Ranking general",null,"Espectadores"]
[null,null,null,null,{"$f":"+[1]a13_ind!R10","v":"MILLONES COP"},{"$f":"+[1]a13_ind!S10","v":"MILES USD"},{"$f":"+[1]a13_ind!T10","v":0},null,null,null,null,null,null,null,null,"$ Constantes (base junio 2011)"]
[{"$f":"+[1]a13_ind!N11","v":2007},{"$f":"+[1]a13_ind!O11","v":"BLUFF"},{"$f":"+[1]a13_ind!P11","v":9},{"$f":"+[1]a13_ind!Q11","v":492947},{"$f":"+[1]a13_ind!R11","v":3809.0406499999999},{"$f":"+[1]a13_ind!S11","v":1833.1989557920135},{"$f":"+[1]a13_ind!T11","v":0},null,null,"2007 \n\n",1,"Bluff",9,"Total de estrenos 198",492947,4473.6637219440508]
[{"$f":"+[1]a13_ind!N12","v":0},{"$f":"+[1]a13_ind!O12","v":"SATANAS"},{"$f":"+[1]a13_ind!P12","v":11},{"$f":"+[1]a13_ind!Q12","v":465408},{"$f":"+[1]a13_ind!R12","v":3510.608107},{"$f":"+[1]a13_ind!S12","v":1689.5706051200521},{"$f":"+[1]a13_ind!T12","v":0},null,null,null,2,"Satanás",11,null,465408,4123.1589718656796]
[{"$f":"+[1]a13_ind!N13","v":0},{"$f":"+[1]a13_ind!O13","v":"ESTO HUELE MAL"},{"$f":"+[1]a13_ind!P13","v":12},{"$f":"+[1]a13_ind!Q13","v":423363},{"$f":"+[1]a13_ind!R13","v":3238.3881529999999},{"$f":"+[1]a13_ind!S13","v":1558.557738292666},{"$f":"+[1]a13_ind!T13","v":0},null,null,null,3,"Esto huele mal",12,null,423363,3803.4405323685642]
[{"$f":"+[1]a13_ind!N14","v":0},{"$f":"+[1]a13_ind!O14","v":"LAS CARTAS DEL GORDO"},{"$f":"+[1]a13_ind!P14","v":20},{"$f":"+[1]a13_ind!Q14","v":294338},{"$f":"+[1]a13_ind!R14","v":2095.8381399999998},{"$f":"+[1]a13_ind!S14","v":1008.6761058213109},{"$f":"+[1]a13_ind!T14","v":0},null,null,null,4,"Las cartas del gordo",20,null,294338,2461.5318962229235]
[{"$f":"+[1]a13_ind!N15","v":0},{"$f":"+[1]a13_ind!O15","v":"MUERTOS DE SUSTO"},{"$f":"+[1]a13_ind!P15","v":28},{"$f":"+[1]a13_ind!Q15","v":196196},{"$f":"+[1]a13_ind!R15","v":1502.81898},{"$f":"+[1]a13_ind!S15","v":723.27035545824867},{"$f":"+[1]a13_ind!T15","v":0},null,null,null,5,"Muertos de susto",28,null,196196,1765.0393811037336]
[{"$f":"+[1]a13_ind!N16","v":2008},{"$f":"+[1]a13_ind!O16","v":"PARAISO TRAVEL"},{"$f":"+[1]a13_ind!P16","v":1},{"$f":"+[1]a13_ind!Q16","v":931245},{"$f":"+[1]a13_ind!R16","v":7285.5783469999997},{"$f":"+[1]a13_ind!S16","v":3707.4140343869058},{"$f":"+[1]a13_ind!T16","v":0},null,null,2008,1,"Paraíso travel",1,"Total de estrenos 200",931245,7983.2832704508992]
[{"$f":"+[1]a13_ind!N17","v":0},{"$f":"+[1]a13_ind!O17","v":"MUERTOS DE SUSTO"},{"$f":"+[1]a13_ind!P17","v":13},{"$f":"+[1]a13_ind!Q17","v":471444},{"$f":"+[1]a13_ind!R17","v":3520.060031},{"$f":"+[1]a13_ind!S17","v":1791.2538084485177},{"$f":"+[1]a13_ind!T17","v":0},null,null,null,2,"Muertos de susto",13,null,471444,3857.1593109058599]
[{"$f":"+[1]a13_ind!N18","v":0},{"$f":"+[1]a13_ind!O18","v":"PERRO COME PERRO"},{"$f":"+[1]a13_ind!P18","v":23},{"$f":"+[1]a13_ind!Q18","v":295681},{"$f":"+[1]a13_ind!R18","v":2328.6238450000001},{"$f":"+[1]a13_ind!S18","v":1184.9673852338574},{"$f":"+[1]a13_ind!T18","v":0},null,null,null,3,"Perro come perro",23,null,295681,2551.624991119123]
[{"$f":"+[1]a13_ind!N19","v":0},{"$f":"+[1]a13_ind!O19","v":"LA MILAGROSA"},{"$f":"+[1]a13_ind!P19","v":32},{"$f":"+[1]a13_ind!Q19","v":181000},{"$f":"+[1]a13_ind!R19","v":1364.6289509999999},{"$f":"+[1]a13_ind!S19","v":694.41906787692949},{"$f":"+[1]a13_ind!T19","v":0},null,null,null,4,"La milagrosa",32,null,181000,1495.3129258951965]
[{"$f":"+[1]a13_ind!N20","v":0},{"$f":"+[1]a13_ind!O20","v":"LOS ACTORES DEL CONFLICTO"},{"$f":"+[1]a13_ind!P20","v":58},{"$f":"+[1]a13_ind!Q20","v":90560},{"$f":"+[1]a13_ind!R20","v":652.49147700000003},{"$f":"+[1]a13_ind!S20","v":332.0334974015812},{"$f":"+[1]a13_ind!T20","v":0},null,null,null,5,"Los actores del conflicto",58,null,90560,714.9774588026811]
[{"$f":"+[1]a13_ind!N21","v":2009},{"$f":"+[1]a13_ind!O21","v":"EL ARRIERO"},{"$f":"+[1]a13_ind!P21","v":25},{"$f":"+[1]a13_ind!Q21","v":285814},{"$f":"+[1]a13_ind!R21","v":2035.0718409999999},{"$f":"+[1]a13_ind!S21","v":943.2116300608933},{"$f":"+[1]a13_ind!T21","v":0},null,null,2009,1,"El arriero",25,"Total de estrenos 214",285814,2148.1535085492078]
[{"$f":"+[1]a13_ind!N22","v":0},{"$f":"+[1]a13_ind!O22","v":"LA PASION DE GABRIEL"},{"$f":"+[1]a13_ind!P22","v":33},{"$f":"+[1]a13_ind!Q22","v":220204},{"$f":"+[1]a13_ind!R22","v":1633.3595620000001},{"$f":"+[1]a13_ind!S22","v":757.02670731886303},{"$f":"+[1]a13_ind!T22","v":0},null,null,null,2,"La pasión de Gabriel",33,null,220204,1724.1195141831347]
[{"$f":"+[1]a13_ind!N23","v":0},{"$f":"+[1]a13_ind!O23","v":"LOS VIAJES DEL VIENTO"},{"$f":"+[1]a13_ind!P23","v":42},{"$f":"+[1]a13_ind!Q23","v":162126},{"$f":"+[1]a13_ind!R23","v":1153.356544},{"$f":"+[1]a13_ind!S23","v":534.55572623572971},{"$f":"+[1]a13_ind!T23","v":0},null,null,null,3,"Los viajes del viento",42,null,162126,1217.4444443122677]
[{"$f":"+[1]a13_ind!N24","v":0},{"$f":"+[1]a13_ind!O24","v":"NI TE CASES NI TE EMBARQUES"},{"$f":"+[1]a13_ind!P24","v":51},{"$f":"+[1]a13_ind!Q24","v":121975},{"$f":"+[1]a13_ind!R24","v":934.67420800000002},{"$f":"+[1]a13_ind!S24","v":433.20120967835379},{"$f":"+[1]a13_ind!T24","v":0},null,null,null,4,"Ni te cases ni te embarques",51,null,121975,986.61071261201346]
[{"$f":"+[1]a13_ind!N25","v":0},{"$f":"+[1]a13_ind!O25","v":"INFRAGANTI"},{"$f":"+[1]a13_ind!P25","v":55},{"$f":"+[1]a13_ind!Q25","v":132777},{"$f":"+[1]a13_ind!R25","v":867.71562500000005},{"$f":"+[1]a13_ind!S25","v":402.16735969546386},{"$f":"+[1]a13_ind!T25","v":0},null,null,null,5,"Infraganti",55,null,132777,915.93148050772857]
[{"$f":"+[1]a13_ind!N26","v":2010},{"$f":"+[1]a13_ind!O26","v":"INFRAGANTI"},{"$f":"+[1]a13_ind!P26","v":23},{"$f":"+[1]a13_ind!Q26","v":463329},{"$f":"+[1]a13_ind!R26","v":2869.4295400000001},{"$f":"+[1]a13_ind!S26","v":1511.0233373135036},{"$f":"+[1]a13_ind!T26","v":0},null,null,2010,1,"Infraganti",23,"Total de estrenos 207",463329,2962.2220375621896]
[{"$f":"+[1]a13_ind!N27","v":0},{"$f":"+[1]a13_ind!O27","v":"SIN TETAS NO HAY PARAISO"},{"$f":"+[1]a13_ind!P27","v":33},{"$f":"+[1]a13_ind!Q27","v":328817},{"$f":"+[1]a13_ind!R27","v":2149.4387860000002},{"$f":"+[1]a13_ind!S27","v":1131.8807876261028},{"$f":"+[1]a13_ind!T27","v":0},null,null,null,2,"Sin tetas no hay paraíso",33,null,328817,2218.948000472637]
[{"$f":"+[1]a13_ind!N28","v":0},{"$f":"+[1]a13_ind!O28","v":"EL PASEO"},{"$f":"+[1]a13_ind!P28","v":34},{"$f":"+[1]a13_ind!Q28","v":312199},{"$f":"+[1]a13_ind!R28","v":2108.9034999999999},{"$f":"+[1]a13_ind!S28","v":1110.5351639483463},{"$f":"+[1]a13_ind!T28","v":0},null,null,null,3,"El paseo**",34,null,312199,2177.1018718905475]
[{"$f":"+[1]a13_ind!N29","v":0},{"$f":"+[1]a13_ind!O29","v":"CHANCE"},{"$f":"+[1]a13_ind!P29","v":70},{"$f":"+[1]a13_ind!Q29","v":117393},{"$f":"+[1]a13_ind!R29","v":649.15155000000004},{"$f":"+[1]a13_ind!S29","v":341.83907561752972},{"$f":"+[1]a13_ind!T29","v":0},null,null,null,4,"Chance",70,null,117393,670.14401305970159]
[{"$f":"+[1]a13_ind!N30","v":0},{"$f":"+[1]a13_ind!O30","v":"DEL AMOR Y OTROS DEMONIOS"},{"$f":"+[1]a13_ind!P30","v":72},{"$f":"+[1]a13_ind!Q30","v":76665},{"$f":"+[1]a13_ind!R30","v":615.20420000000001},{"$f":"+[1]a13_ind!S30","v":323.96261711771604},{"$f":"+[1]a13_ind!T30","v":0},null,null,null,5,"Del amor y otros demonios",72,null,76665,635.09886318407962]
[{"$f":"+[1]a13_ind!N31","v":"2011*"},{"$f":"+[1]a13_ind!O31","v":"EL PASEO"},{"$f":"+[1]a13_ind!P31","v":2},{"$f":"+[1]a13_ind!Q31","v":1189607},{"$f":"+[1]a13_ind!R31","v":7949.1236660000004},{"$f":"+[1]a13_ind!S31","v":4323.861370606649},{"$f":"+[1]a13_ind!T31","v":0},null,null,"Ene-Jun\n 2011",1,"El paseo**",2,"Total de estrenos 101",1189607,7949.1236660000004]
[{"$f":"+[1]a13_ind!N32","v":0},{"$f":"+[1]a13_ind!O32","v":"LOS COLORES DE LA MONTAQA"},{"$f":"+[1]a13_ind!P32","v":11},{"$f":"+[1]a13_ind!Q32","v":378177},{"$f":"+[1]a13_ind!R32","v":2782.9712500000001},{"$f":"+[1]a13_ind!S32","v":1513.7746485002165},{"$f":"+[1]a13_ind!T32","v":0},null,null,null,2,"Los colores de la montaña",11,null,378177,2782.9712500000001]
[{"$f":"+[1]a13_ind!N33","v":0},{"$f":"+[1]a13_ind!O33","v":"EL JEFE"},{"$f":"+[1]a13_ind!P33","v":13},{"$f":"+[1]a13_ind!Q33","v":318441},{"$f":"+[1]a13_ind!R33","v":2175.2725660000001},{"$f":"+[1]a13_ind!S33","v":1183.2218762550326},{"$f":"+[1]a13_ind!T33","v":0},null,null,null,3,"El jefe",13,null,318441,2175.2725660000001]
[{"$f":"+[1]a13_ind!N34","v":0},{"$f":"+[1]a13_ind!O34","v":"EN COMA"},{"$f":"+[1]a13_ind!P34","v":85},{"$f":"+[1]a13_ind!Q34","v":174360},{"$f":"+[1]a13_ind!R34","v":1209.6138599999999},{"$f":"+[1]a13_ind!S34","v":657.9596522035539},{"$f":"+[1]a13_ind!T34","v":0},null,null,null,4,"En coma",85,null,174360,1209.6138599999999]
[{"$f":"+[1]a13_ind!N35","v":0},{"$f":"+[1]a13_ind!O35","v":"LECCIONES PARA UN BESO"},{"$f":"+[1]a13_ind!P35","v":86},{"$f":"+[1]a13_ind!Q35","v":95544},{"$f":"+[1]a13_ind!R35","v":615.62773800000002},{"$f":"+[1]a13_ind!S35","v":334.8657168836844},{"$f":"+[1]a13_ind!T35","v":0},null,null,null,5,"Lecciones para un beso",86,null,95544,615.62773800000002]
[]
[null,null,null,null,null,null,null,null,null,"Las cinco películas colombianas más taquilleras por año"]
[null,null,null,null,null,null,null,null,null,"2007 – Junio  2011"]

{"sheet":"Población","index":8,"n_rows":27,"n_cols":5,"rows_kept":27,"cut":false,"hidden":false,"merged":[]}
[" ","Población"]
["Chile *",17.190000000000001]
["Canada",34.058999999999997]
["Argentina **",40.518999999999998]
["Colombia *",45.512]
["España",46.018000000000001]
["Mexico",108.627]
["Brasil *",193.25299999999999]
["Estados Unidos",309.99700000000001]
[]
[]
[]
[]
[]
[]
[]
[]
[]
[]
[]
[]
[]
[]
[]
[]
[]
[null,null,null,null,"Población"]

{"sheet":"PIB habitante","index":9,"n_rows":27,"n_cols":4,"rows_kept":27,"cut":false,"hidden":false,"merged":[]}
[" ","PIB-habitante"]
["Colombia *",6273.3720000000003]
["Argentina **",9138.1769999999997]
["México",9565.9619999999995]
["Brasil *",10816.486999999999]
["Chile *",11827.958000000001]
["España",30639.294999999998]
["Canadá",46214.913999999997]
["Estados Unidos",47283.633000000002]
[]
[]
[]
[]
[]
[]
[]
[]
[]
[]
[]
[]
[]
[]
[]
[]
[]
[null,null,null,"PIB por habitante"]

{"sheet":"Internacionales","index":10,"n_rows":64,"n_cols":56,"rows_kept":64,"cut":false,"hidden":false,"merged":[]}
["Asistencia",null,null,null,null,null,null,null,null,null,"Indice de asistencia",null,null,null,null,null,null,null,null,null,null,null,"Estrenos","Argentina","Brasil","Chile","Colombia","España","EE.UU./Canadá (eje der.)","México",null,null,null,null,"Asistentes a cine nacional",null,null,null,null,null,null,null,null,null,null,"Participación asistencia cine nacional"]
[null,"Argentina","Brasil","Chile","Colombia","España","EE.UU./Canadá (eje der.)","México","Columna1",null,null,"Argentina","Brasil","Chile","Colombia","España","EE.UU./Canadá","México",null,null,null,null,2000,45,24,8,{"$f":"+'Estrenos de películas Col.'!C9","v":4},null,null,16,null,null,"Colombia",null,null,2007,2008,2009,2010,null,null,null,null,null,null,null,"2007","2008","2009","2010",null,null,"Prom. 2007-2010",null,null,"Prom. 2007-2010"]
[2000,33.572678000000003,72,11.1,{"$f":"+'Asistencia a Cine en Colombia'!B13/10^6","v":17.2},135.30000000000001,1421,90,null,null,2000,{"$f":"+Tabla14[[#This Row],[Argentina]]/B41","v":0.91269785776424539},{"$f":"+Tabla14[[#This Row],[Brasil]]/C41","v":0.42036431574030825},{"$f":"+Tabla14[[#This Row],[Chile]]/D41","v":0.72973506015383605},{"$f":"+'Ind de Asistencia a Cine en Col'!B12","v":0.42684600287133351},{"$f":"+Tabla14[[#This Row],[España]]/F41","v":3.3604053349228824},{"$f":"+Tabla14[[#This Row],[EE.UU./Canadá (eje der.)]]/G41","v":4.5407630143508566},{"$f":"+Tabla14[[#This Row],[México]]/H41","v":0.91868607476063124},null,null,null,null,2001,45,30,19,{"$f":"+'Estrenos de películas Col.'!C10","v":7},106,454,19,null,null,{"$f":"+'Asistencia a Cine en Colombia'!C20","v":2387135},null,"Chile",0.94079999999999997,0.94010000000000005,0.41365999999999997,0.27930000000000005,null,null,null,null,null,null,"Chile",{"$f":"+AJ3/AJ35","v":8.4000000000000005E-2},{"$f":"+AK3/AK35","v":7.9000000000000001E-2},3.69973459864507E-2,2.1000000000000001E-2,null,"Chile",5.5249336496612671E-2,null,"Chile",{"$f":"+AVERAGE(AU3:AX3)","v":5.5249336496612671E-2}]
[2001,31.346268999999999,75,11.4,{"$f":"+'Asistencia a Cine en Colombia'!B14/10^6","v":17.797999999999998},146.80000000000001,1430,139,null,null,2001,{"$f":"+Tabla14[[#This Row],[Argentina]]/B42","v":0.84363949294864893},{"$f":"+Tabla14[[#This Row],[Brasil]]/C42","v":0.43147587762193507},{"$f":"+Tabla14[[#This Row],[Chile]]/D42","v":0.74016361511492024},{"$f":"+'Ind de Asistencia a Cine en Col'!B13","v":0.43608076054954409},{"$f":"+Tabla14[[#This Row],[España]]/F42","v":3.6051080550098233},{"$f":"+Tabla14[[#This Row],[EE.UU./Canadá (eje der.)]]/G42","v":4.5226400832418792},{"$f":"+Tabla14[[#This Row],[México]]/H42","v":1.3937491853084798},null,null,null,null,2002,37,35,8,{"$f":"+'Estrenos de películas Col.'!C11","v":4},137,475,17,null,null,{"$f":"+'Asistencia a Cine en Colombia'!C21","v":2278429},null,"Colombia",2.3871349999999998,2.278429,1.20828,1.5306999999999999,null,null,null,null,null,null,"Colombia",{"$f":"+AJ4/AJ36","v":0.11549372735674435},0.10566442502083558,4.463920723179688E-2,4.5481974777604968E-2,null,"Argentina",6.9263806733956948E-2,null,"Colombia",{"$f":"+AVERAGE(AU4:AX4)","v":7.7819833596745436E-2}]
[2002,31.883803,90.8,11.9,{"$f":"+'Asistencia a Cine en Colombia'!B15/10^6","v":18.399000000000001},140.71,1570,132,null,null,2002,{"$f":"+Tabla14[[#This Row],[Argentina]]/B43","v":0.84987213455592281},{"$f":"+Tabla14[[#This Row],[Brasil]]/C43","v":0.51476549257048265},{"$f":"+Tabla14[[#This Row],[Chile]]/D43","v":0.76335877862595425},{"$f":"+'Ind de Asistencia a Cine en Col'!B14","v":0.44518566509417251},{"$f":"+Tabla14[[#This Row],[España]]/F43","v":3.4349672883507472},{"$f":"+Tabla14[[#This Row],[EE.UU./Canadá (eje der.)]]/G43","v":4.9166209974164259},{"$f":"+Tabla14[[#This Row],[México]]/H43","v":1.307953745999346},null,null,null,null,2003,46,26,8,{"$f":"+'Estrenos de películas Col.'!C12","v":5},110,455,25,null,null,{"$f":"+'Asistencia a Cine en Colombia'!C22","v":1208280},null,"Argentina",3.40754,3.63748,5.2147799999999993,3.496,null,null,null,null,null,null,"México",9.9394695597072313E-2,0.10792244079624205,0.15531832068048673,9.0891766261527535E-2,null,"Colombia",7.7819833596745436E-2,null,"México",0.11338180583383214]
[2003,33.378780999999996,104.6,11.5,{"$f":"+'Asistencia a Cine en Colombia'!B16/10^6","v":17.085999999999999},137.47,1520,137,null,null,2003,{"$f":"+Tabla14[[#This Row],[Argentina]]/B44","v":0.88140430419857407},{"$f":"+Tabla14[[#This Row],[Brasil]]/C44","v":0.58440651451238923},{"$f":"+Tabla14[[#This Row],[Chile]]/D44","v":0.73020509238681819},{"$f":"+'Ind de Asistencia a Cine en Col'!B15","v":0.40827777818798311},{"$f":"+Tabla14[[#This Row],[España]]/F44","v":3.2994911674347156},{"$f":"+Tabla14[[#This Row],[EE.UU./Canadá (eje der.)]]/G44","v":4.7156201816134242},{"$f":"+Tabla14[[#This Row],[México]]/H44","v":1.3430450851412157},null,null,null,null,2004,54,46,12,{"$f":"+'Estrenos de películas Col.'!C13","v":8},133,489,18,null,null,{"$f":"+'Asistencia a Cine en Colombia'!C23","v":1530700},null,"México",13.395979999999998,13.194999999999999,12.406599999999999,11.4,null,null,null,null,null,null,"Argentina",7.5342969628796386E-2,7.234100877192981E-2,6.9117548746518098E-2,6.0253699788583512E-2,null,"México",0.11338180583383214,null,"Argentina",6.9263806733956948E-2]
[2004,44.507697,117.4,9.9,{"$f":"+'Asistencia a Cine en Colombia'!B17/10^6","v":17.122},143.93,1500,164,null,null,2004,{"$f":"+Tabla14[[#This Row],[Argentina]]/B45","v":1.1643304818709779},{"$f":"+Tabla14[[#This Row],[Brasil]]/C45","v":0.64652561320806667},{"$f":"+Tabla14[[#This Row],[Chile]]/D45","v":0.61909824276155345},{"$f":"+'Ind de Asistencia a Cine en Col'!B16","v":0.40412109103064781},{"$f":"+Tabla14[[#This Row],[España]]/F45","v":3.3989845318219389},{"$f":"+Tabla14[[#This Row],[EE.UU./Canadá (eje der.)]]/G45","v":4.6112841196597492},{"$f":"+Tabla14[[#This Row],[México]]/H45","v":1.5921557205960877},null,null,null,null,2005,65,51,19,{"$f":"+'Estrenos de películas Col.'!C14","v":8},128,507,25,null,null,null,null,"España ",15.797243,14.36,17.48,12.933679999999999,null,null,null,null,null,null,"España ",0.1351,0.13319729153139781,0.15892353850350033,0.1273,null,"Brasil",0.1362378377527545,null,"España ",0.13863020750872454]
[2005,37.617694999999998,93.6,11.185207,{"$f":"+'Asistencia a Cine en Colombia'!B18/10^6","v":15.94},127.65,1380,165.9,null,null,2005,{"$f":"+Tabla14[[#This Row],[Argentina]]/B46","v":0.97475370543117745},{"$f":"+Tabla14[[#This Row],[Brasil]]/C46","v":0.50818746470920384},{"$f":"+Tabla14[[#This Row],[Chile]]/D46","v":0.68933853075311236},{"$f":"+'Ind de Asistencia a Cine en Col'!B17","v":0.37166060382677052},{"$f":"+Tabla14[[#This Row],[España]]/F46","v":2.9659835494214417},{"$f":"+Tabla14[[#This Row],[EE.UU./Canadá (eje der.)]]/G46","v":4.2032163742690063},{"$f":"+Tabla14[[#This Row],[México]]/H46","v":1.5960210109095108},null,null,null,null,2006,58,70,11,{"$f":"+'Estrenos de películas Col.'!C15","v":8},142,594,33,null,null,null,null,"Brasil",10.3,8.8000000000000007,15.90197,25.6,null,null,null,null,null,null,"Brasil",0.11531571876399464,9.876543209876544E-2,0.1411,0.18977020014825796,null,"España ",0.13863020750872454,null,"Brasil",0.1362378377527545]
[2006,35.767819000000003,90.2,11.5,{"$f":"+'Asistencia a Cine en Colombia'!B19/10^6","v":20.216614},121.65,1400,168.4,null,null,2006,{"$f":"+Tabla14[[#This Row],[Argentina]]/B47","v":0.91780603525698612},{"$f":"+Tabla14[[#This Row],[Brasil]]/C47","v":0.48608566316742474},{"$f":"+Tabla14[[#This Row],[Chile]]/D47","v":0.70062142073839395},{"$f":"+'Ind de Asistencia a Cine en Col'!B18","v":0.46575668094949918},{"$f":"+Tabla14[[#This Row],[España]]/F47","v":2.7800630741807213},{"$f":"+Tabla14[[#This Row],[EE.UU./Canadá (eje der.)]]/G47","v":4.223699176076968},{"$f":"+Tabla14[[#This Row],[México]]/H47","v":1.605996738415175},null,null,null,null,2007,68,82,12,{"$f":"+'Estrenos de películas Col.'!C16","v":10},137,609,43,null,null,null,null,"EEUU",1260,1248.06,1199.826,1233.72,null,null,null,null,null,null,"EEUU",0.9,0.93138805970149252,0.84494788732394366,0.92068656716417907,null,"EEUU",0.89925562854740382,null,"EEUU",0.89925562854740382]
[2007,34.282916,89.32,11.2,{"$f":"+'Asistencia a Cine en Colombia'!B20/10^6","v":20.668958},116.93,1400,177.8,null,null,2007,{"$f":"+Tabla14[[#This Row],[Argentina]]/B48","v":0.87109757089135076},{"$f":"+Tabla14[[#This Row],[Brasil]]/C48","v":0.47601283294784746},{"$f":"+Tabla14[[#This Row],[Chile]]/D48","v":0.67534973468403281},{"$f":"+'Ind de Asistencia a Cine en Col'!B19","v":0.47053045752413059},{"$f":"+Tabla14[[#This Row],[España]]/F48","v":2.6291174817313099},{"$f":"+Tabla14[[#This Row],[EE.UU./Canadá (eje der.)]]/G48","v":4.1817758209722031},{"$f":"+Tabla14[[#This Row],[México]]/H48","v":1.6806722689075633},null,null,null,null,2008,71,79,24,{"$f":"+'Estrenos de películas Col.'!C17","v":13},139,634,46]
[2008,33.704574999999998,89.1,11.9,{"$f":"+'Asistencia a Cine en Colombia'!B21/10^6","v":21.562877},107.81,1340,182.4,null,null,2008,{"$f":"+Tabla14[[#This Row],[Argentina]]/B49","v":0.84799916972777123},{"$f":"+Tabla14[[#This Row],[Brasil]]/C49","v":0.46990448967106685},{"$f":"+Tabla14[[#This Row],[Chile]]/D49","v":0.71044776119402986},{"$f":"+'Ind de Asistencia a Cine en Col'!B20","v":0.48509157705199374},{"$f":"+Tabla14[[#This Row],[España]]/F49","v":2.3808051586688159},{"$f":"+Tabla14[[#This Row],[EE.UU./Canadá (eje der.)]]/G49","v":3.9647199102908153},{"$f":"+Tabla14[[#This Row],[México]]/H49","v":1.7097381963386855},null,null,null,null,2009,77,84,15,{"$f":"+'Estrenos de películas Col.'!C18","v":12},137,655,54]
[2009,33.57479,112.7,11.180802,{"$f":"+'Asistencia a Cine en Colombia'!B22/10^6","v":27.067685000000001},109.99,1420,179.5,null,null,2009,{"$f":"+Tabla14[[#This Row],[Argentina]]/B50","v":0.83656724971345986},{"$f":"+Tabla14[[#This Row],[Brasil]]/C50","v":0.588570145340791},{"$f":"+Tabla14[[#This Row],[Chile]]/D50","v":0.65831382477625988},{"$f":"+'Ind de Asistencia a Cine en Col'!B21","v":0.60178719180613671},{"$f":"+Tabla14[[#This Row],[España]]/F50","v":2.4000610980186781},{"$f":"+Tabla14[[#This Row],[EE.UU./Canadá (eje der.)]]/G50","v":4.1636978328245995},{"$f":"+Tabla14[[#This Row],[México]]/H50","v":1.6689756487619827},null,null,null,null,2010,84,75,null,{"$f":"+'Estrenos de películas Col.'!C19","v":10},null,560,54]
[2010,38.463329999999999,134.9,13.3,{"$f":"+'Asistencia a Cine en Colombia'!B23/10^6","v":33.655090999999999},101.6,1340,189.2,null,null,2010,{"$f":"+Tabla14[[#This Row],[Argentina]]/B51","v":0.94926651694266884},{"$f":"+Tabla14[[#This Row],[Brasil]]/C51","v":0.69804867194817166},{"$f":"+Tabla14[[#This Row],[Chile]]/D51","v":0.7737056428155904},{"$f":"+'Ind de Asistencia a Cine en Col'!B22","v":0.73951655985253573},{"$f":"+Tabla14[[#This Row],[España]]/F51","v":2.2078317180233822},{"$f":"+Tabla14[[#This Row],[EE.UU./Canadá (eje der.)]]/G51","v":3.8947148138675094},{"$f":"+Tabla14[[#This Row],[México]]/H51","v":1.7417400830364458}]
[]
[null,null,{"$f":"+C13-C3","v":62.900000000000006},null,null,null,{"$f":"+G5-G13","v":230},{"$f":"+H13-H3","v":99.199999999999989}]
[]
[]
[]
[]
[]
[]
[]
[]
[]
[]
[]
[]
[]
[]
[]
[]
[null,null,null,null,null,null,null,null,null,null,null,null,null,null,null,null,null,null,null,null,null,null,null,null,null,null,null,null,null,null,null,null,null,null,"Asistencia a  largometrajes nacionales en algunos países iberoamericanos "]
[null,null,null,null,null,null,null,null,null,null,null,null,null,null,null,null,null,null,null,null,null,null,null,null,null,null,null,null,null,null,null,null,null,null,"2007 – 2010"]
[null,null,null,null,null,null,null,null,null,null,null,null,null,null,null,null,null,null,null,null,null,null,null,null,null,null,null,null,null,null,null,null,null,null,null,2007,2008,2009,2010,null,null,null,null,null,null,null,"Participación promedio de los espectadores de largometrajes nacionales en el total de espectadores en algunos países iberoamericanos "]
[null,null,null,null,null,null,null,null,null,null,null,null,null,null,null,null,null,null,null,null,null,null,"Estrenos de largometrajes nacionales en algunos países iberoamericanos y Estados Unidos/Canadá. 2000-2010",null,null,null,null,null,null,null,null,null,null,null,"Chile",11.2,11.9,11.180802,13.3,null,null,null,null,null,null,null,"2007 – 2010"]
[null,null,null,null,null,null,null,null,null,null,"Índice de asistencia en algunos países iberoamericanos y Estados Unidos/Canadá. 2000-2010",null,null,null,null,null,null,null,null,null,null,null,null,null,null,null,null,null,null,null,null,null,null,null,"Colombia",20.668958,21.562877,27.067685000000001,33.655090999999999]
["Asistencia a cine en algunos países iberoamericanos y Estados Unidos/Canadá. 2000-2010",null,null,null,null,null,null,null,null,null,null,null,null,null,null,null,null,null,null,null,null,null,null,null,null,null,null,null,null,null,null,null,null,null,"Argentina",34.282916,33.704574999999998,33.57479,38.463329999999999]
[null,null,null,null,null,null,null,null,null,null,null,null,null,null,null,null,null,null,null,null,null,null,null,null,null,null,null,null,null,null,null,null,null,null,"México",177.8,182.4,179.5,189.2]
[null,null,null,null,null,null,null,null,null,null,null,null,null,null,null,null,null,null,null,null,null,null,null,null,null,null,null,null,null,null,null,null,null,null,"España",116.93,107.81,109.99,101.6]
["Población","Argentina","Brasil","Chile","Colombia","España","EE.UU./Canadá (eje der.)","México",null,null,null,null,null,null,null,null,null,null,null,null,null,null,null,null,null,null,null,null,null,null,null,null,null,null,"Brasil",89.32,89.1,112.7,134.9]
[2000,36.783999999999999,171.28,15.211,null,40.262999999999998,312.94299999999998,97.965999999999994,null,null,null,null,null,null,null,null,null,null,null,null,null,null,null,null,null,null,null,null,null,null,null,null,null,null,"EE.UU./Canadá (eje der.)",1400,1340,1420,1340]
[2001,37.155999999999999,173.822,15.401999999999999,null,40.72,316.18700000000001,99.730999999999995]
[2002,37.515999999999998,176.39099999999999,15.589,null,40.963999999999999,319.32499999999999,100.92100000000001]
[2003,37.869999999999997,178.98500000000001,15.749000000000001,null,41.664000000000001,322.33300000000003,102.00700000000001]
[2004,38.225999999999999,181.58600000000001,15.991,null,42.344999999999999,325.28899999999999,103.005]
[2005,38.591999999999999,184.184,16.225999999999999,null,43.037999999999997,328.32,103.946]
[2006,38.970999999999997,185.56399999999999,16.414000000000001,null,43.758000000000003,331.46300000000002,104.857]
[2007,39.356000000000002,187.642,16.584,null,44.475000000000001,334.786,105.791]
[2008,39.746000000000002,189.613,16.75,null,45.283000000000001,337.98099999999999,106.68300000000001]
[2009,40.134,191.48099999999999,16.984000000000002,null,45.828000000000003,341.04300000000001,107.551]
[2010,40.518999999999998,193.25299999999999,17.190000000000001,null,46.018000000000001,344.05600000000004,108.627]
[]
[]
[]
[null,"Country","Subject Descriptor","Units","Scale","Country/Series-specific Notes",2000,2001,2002,2003,2004,2005,2006,2007,2008,2009,2010]
[null,"Argentina","Population","Persons","Millions",null,36.783999999999999,37.155999999999999,37.515999999999998,37.869999999999997,38.225999999999999,38.591999999999999,38.970999999999997,39.356000000000002,39.746000000000002,40.134,40.518999999999998]
[null,"Brazil","Population","Persons","Millions",null,171.28,173.822,176.39099999999999,178.98500000000001,181.58600000000001,184.184,185.56399999999999,187.642,189.613,191.48099999999999,193.25299999999999]
[null,"Canada","Population","Persons","Millions",null,30.646999999999998,30.971,31.306000000000001,31.6,31.9,32.204999999999998,32.533000000000001,32.883000000000003,33.262999999999998,33.668999999999997,34.058999999999997]
[null,"Chile","Population","Persons","Millions",null,15.211,15.401999999999999,15.589,15.749000000000001,15.991,16.225999999999999,16.414000000000001,16.584,16.75,16.984000000000002,17.190000000000001]
[null,"Colombia","Population","Persons","Millions",null,40.281999999999996,40.805999999999997,41.326999999999998,41.847000000000001,42.368000000000002,42.889000000000003,43.405000000000001,43.926000000000002,44.45,44.978000000000002,45.512]
[null,"Mexico","Population","Persons","Millions",null,97.965999999999994,99.730999999999995,100.92100000000001,102.00700000000001,103.005,103.946,104.857,105.791,106.68300000000001,107.551,108.627]
[null,"Spain","Population","Persons","Millions",null,40.262999999999998,40.72,40.963999999999999,41.664000000000001,42.344999999999999,43.037999999999997,43.758000000000003,44.475000000000001,45.283000000000001,45.828000000000003,46.018000000000001]
[null,"United States","Population","Persons","Millions",null,282.29599999999999,285.21600000000001,288.01900000000001,290.733,293.38900000000001,296.11500000000001,298.93,301.90300000000002,304.71800000000002,307.37400000000002,309.99700000000001]
[null,null,null,null,null,"EE.UU./Canadá (eje der.)",{"$f":"+G58+G63","v":312.94299999999998},{"$f":"+H58+H63","v":316.18700000000001},319.32499999999999,322.33300000000003,325.28899999999999,328.32,331.46300000000002,334.786,337.98099999999999,341.04300000000001,344.05600000000004]

{"sheet":"Aprobado FDC","index":11,"n_rows":75,"n_cols":5,"rows_kept":75,"cut":false,"hidden":false,"merged":[]}
[]
[]
[]
[" ","P. Aprobado"]
[2004,4369957731]
[2005,7861454127]
[2006,7362028401]
[2007,7246592791]
[2008,8113957849]
[2009,9859475293]
[2010,13648556653]
[2011,17886632672,null,{"$f":"+Tabla15[[#This Row],[P. Aprobado]]/B5","v":4.0930905452732853}]
[]
[null,{"$f":"+B12/B5*100","v":409.30905452732856}]
[]
[]
[]
[]
[]
[]
[]
[]
[]
[]
[]
[]
[null,null,null,"Recursos  aprobados para el FDC"]
[null,null,null,"Millones de pesos corrientes. 2004 - 2011*"]
[]
[" ","P. Aprobado","Producción - 70%","Otros estimulos - 30%","P. Aprobado2"]
[2004,4369957731,2623200000,1746757731,4369957731]
[2005,7861454127,5015366930,2846087197,7861454127]
[2006,7362028401,5230193835,2131834566,7362028401]
[2007,7246592791,5329280406,1917312385,7246592791]
[2008,8113957849,5858513148,2255444701,8113957849]
[2009,9859475293,6897261282,2962214011,9859475293]
[2010,13648556653,9518067751,4130488902,13648556653]
[2011,17886632672,13365000000,4521632672,17886632672]
[]
[null,2004,{"$f":"+C31/B31","v":0.60028040577859765},null,{"$f":"+E38/E31*100","v":409.30905452732856}]
[null,2005,{"$f":"+C32/B32","v":0.63796936914950975}]
[null,2006,0.71042836975331036]
[null,2007,0.73541877675516265]
[null,2008,0.72202903404557728]
[null,2009,0.69955662720681455]
[null,2010,0.69736808022904717]
[null,2011,0.74720604180135985]
[]
[]
[]
[]
[]
[]
[]
[]
[]
[]
[]
[]
[]
[]
[]
[]
[]
[]
[]
[]
[]
[]
[]
[]
[]
[]
[null,null,"Asignación de los estímulos aprobados para el FDC"]
[null,null,"Millones de pesos corrientes. 2004 - 2011*"]

{"sheet":"Destino FDC y ANEXO 2","index":12,"n_rows":73,"n_cols":9,"rows_kept":73,"cut":false,"hidden":false,"merged":[]}
["Columna1","2004","2005","2006","2007","2008","2009","2010","2011"]
["Escritura de guiones",0,130,75,136,180,340,400,460]
["Producción de largometrajes",1090,3101.6,3070,3480,3306,3891.6,6220,7550]
["Realización de cortometrajes",540,400,324,250,250,250,455,640]
["Realización de documentales",340,400,420,100,325,500,240,1150]
["Promoción largometrajes en territorio nacional",400,588.9,838.6,734.9,1186,1000,906.6,1400]
["Otros ",253.2,394.90000000000003,502.6,628.5,611.6,915.59999999999991,1296.5,2165]
[]
[]
[]
[null,2004,2005,2006,2007,2008,2009,2010,2011]
["Escritura de guiones",{"$f":"+B25","v":0},{"$f":"+C25","v":130},75,136,180,340,400,460]
["Producción de largometrajes",{"$f":"+B26+B27","v":1090},{"$f":"+C26+C27","v":3101.6},3070,3480,3306,3891.6,6220,7550]
["Realización de cortometrajes",{"$f":"+B28","v":540},{"$f":"+C28","v":400},324,250,250,250,455,640]
["Realización de documentales",{"$f":"+B29","v":340},400,420,100,325,500,240,1150]
["Promoción largometrajes en territorio nacional",{"$f":"+B30","v":400},588.9,838.6,734.9,1186,1000,906.6,1400]
["Otros ",{"$f":"+SUM(B31:B36)","v":253.2},{"$f":"+SUM(C31:C36)","v":394.90000000000003},502.6,628.5,611.6,915.59999999999991,1296.5,2165]
[]
[]
[]
[]
[]
["Descripción del estimulo ",2004,2005,2006,2007,2008,2009,2010,2011]
["Producción 70%",2623.2,5015.3999999999996,5230.2,5329.3,5858.5,6897.3,9518.1,13365]
["Escritura de guiones",0,130,75,136,180,340,400,460]
["Producción de largometrajes (rodaje y postproducción)",1090,3101.6,3070,3480,3306,3491.6,5620,7550]
["Producción de largometrajes para finalizar en digital",0,0,0,0,0,400,600,0]
["Realización de cortometrajes",540,400,324,250,250,250,455,640]
["Realización de documentales",340,400,420,100,325,500,240,1150]
["Promoción largometrajes en territorio nacional",400,588.9,838.6,734.9,1186,1000,906.6,1400]
["Promoción y divulgación de cortometrajes y documentales",0,0,17.5,0,0,0,0,200]
["Participación de proyectos en eventos y festivales internacionales",77,18.2,58.5,100.3,81.7,188.6,130.9,280]
["Participación de proyectos de largometrajes en encuentros",6.2,9,32.700000000000003,41.2,80,72.599999999999994,138.30000000000001,150]
["Participación de largometrajes en mercados cinematográficos",0,0,0,0,14.4,18.7,66.5,100]
["Participación en talleres de formación",0,54.1,50.8,214.9,95.9,156.69999999999999,418.6,700]
["Gastos para la realización de convocatorias",170,313.60000000000002,343.1,272.10000000000002,339.6,479,542.20000000000005,735]
["Otros estímulos 30%",1746.8,2846.1,2131.8000000000002,1917.3,2255.4,2962.2,4130.5,4521.6000000000004]
["Otros programas de formación",400,279.8,476.7,250.3,225.9,280,1032,520]
["Preservación del patrimonio fílmico",590.4,1330,600,550,550,900,590,600]
["Proyecto antipiratería",0,300,300,400,400,400,290,320]
["Promoción internacional",0,0,0,0,149.6,264.3,528,486.5]
["Resto (otros estímulos)",756.4,936.3,755.1,717,929.9,1118,1690.5,2595.1]
["Totales",4370,7861.5,7362,7246.6,8114,9859.5,13648.6,17886.599999999999]
[]
[]
[]
[]
[]
[]
[]
[]
[]
[]
[]
[]
[]
[]
[]
[]
[]
[]
[]
[]
[]
[]
[]
[]
[]
[]
[]
[]
["Estímulos aprobados para el FDC*- Producción 70%"]
["Millones de pesos corrientes. 2004 - 2011*"]

{"sheet":"Tributarios","index":13,"n_rows":39,"n_cols":5,"rows_kept":39,"cut":false,"hidden":false,"merged":[[1,0,2,0],[1,1,1,2],[1,4,2,4]]}
[]
["Año*","Número de certificados otorgados",null,"Monto","Número de proyectos beneficiados"]
[null,"Inversión","Donación","(Millones de pesos)"]
[2004,16,0,505,2]
[2005,93,1,1956,12]
[2006,79,4,8609.5,15]
[2007,54,1,6466,22]
[2008,85,0,20613.599999999999,21]
[2009,92,2,10883.3,25]
[2010,92,1,17121.3,25]
["Totales",517,9,66154.7,"80**"]
[]
[]
[]
[]
[]
[]
[]
[]
[]
[]
[]
[]
[]
[]
[]
[]
[]
[]
[]
[]
[]
[]
[]
[]
[]
[]
["Estímulos tributarios"]
["Millones de pesos corrientes. 2004 - 2010*"]

{"sheet":"Informe Especial 1","index":14,"n_rows":2262,"n_cols":43,"rows_kept":2262,"cut":false,"hidden":false,"merged":[]}
["Columna1","Espectadores por habitante","PIB real - variación anual  (eje derecho) ",null,null,null,null,null,null,null,null,null,null,"city","SI INFORME","date_mes","date_aqo","boxoffice","admissions",null,"ciudades seleccionadas",null,null,"Suma de admissions","Etiquetas de columna",null,null,null,null,null,null,"Variación anual"]
[2000,{"$f":"+'Ind de Asistencia a Cine en Col'!B12","v":0.42684600287133351},null,null,null,null,null,null,null,null,null,null,null,"ARMENIA",{"$f":"+VLOOKUP(N2,$U$2:$V$16,2,FALSE)","v":{"$error":"#N/A"}},9,2006,69911250,10737,null,"VALLEDUPAR","SI",null,"Etiquetas de fila",2007,2008,2009,2010,"2010*","2011*"]
[2001,{"$f":"+'Ind de Asistencia a Cine en Col'!B13","v":0.43608076054954409},1.6778983077036571,null,null,null,null,null,null,null,null,null,null,"BARRANQUILLA",{"$f":"+VLOOKUP(N3,$U$2:$V$16,2,FALSE)","v":"SI"},9,2006,273119900,40518,null,"NEIVA","SI",null,null,null,null,null,null,null,null,null,null,2008,2009,2010,"2011*",null,null,null,2008,2009,2010,"2011*"]
[2002,{"$f":"+'Ind de Asistencia a Cine en Col'!B14","v":0.44518566509417251},2.5039804654986,null,null,null,null,null,null,null,null,null,null,"BELLO",{"$error":"#N/A"},9,2006,118849600,20609,null,"MANIZALES","SI",null,"BARRANQUILLA",929241,1128151,1256435,1472241,711428,818750,null,"Barranquilla",{"$f":"+Z4/Y4*100-100","v":21.405641808744974},{"$f":"+AA4/Z4*100-100","v":11.371172830587398},17.176057655191073,{"$f":"+AD4/AC4*100-100","v":15.085433803561287},null,null,"Floridablanca",-2.6097742228476761,23.245398196325183,-3.1554751981147433E-2,5.5591880578891022]
[2003,{"$f":"+'Ind de Asistencia a Cine en Col'!B15","v":0.40827777818798311},3.9182719036083,null,null,null,null,null,null,null,null,null,null,"BOGOTA","SI",9,2006,2610435870,362828,null,"SANTA MARTA","SI",null,"BOGOTA",9493415,9594614,12465304,14907415,7588803,8171870,null,"Bogotá",{"$f":"+Z5/Y5*100-100","v":1.0659915320250946},29.919807091770451,19.591267088231461,7.6832538675730433,null,null,"Cartagena",7.6350447490526818,59.168989377929393,12.280006316259474,5.1885115505743755]
[2004,{"$f":"+'Ind de Asistencia a Cine en Col'!B16","v":0.40412109103064781},5.3330220674539248,null,null,null,null,null,null,null,null,null,null,"BUCARAMANGA","SI",9,2006,35170900,6314,null,"IBAGUE","SI",null,"BUCARAMANGA",234845,295109,357072,914707,410057,542013,null,"Bucaramanga",25.66118077881157,20.996648695905577,156.16878388672313,32.17991645063978,null,null,"Medellín",3.2197647846527815,11.276058017283347,13.876811364629987,8.916124681568931]
[2005,{"$f":"+'Ind de Asistencia a Cine en Col'!B17","v":0.37166060382677052},4.7065559338311829,null,null,null,null,null,null,null,null,null,null,"BUGA",{"$error":"#N/A"},9,2006,4760000,1016,null,"FLORIDABLANCA","SI",null,"CALI",2165068,2129496,2325329,3338962,1586129,1936524,null,"Cali",-1.642996894323872,9.1962135641485077,43.590949925795428,22.09120443545261,null,null,"Cúcuta",82.566999349443847,36.485739514962717,14.501583679000291,1.6838112752140688]
[2006,{"$f":"+'Ind de Asistencia a Cine en Col'!B18","v":0.46575668094949918},6.6975152577052768,null,null,null,null,null,null,null,null,null,null,"CALI","SI",9,2006,690778550,92090,null,"PEREIRA","SI",null,"CARTAGENA",535989,576912,918265,1031028,556942,585839,null,"Cartagena",7.6350447490526818,59.168989377929393,12.280006316259474,5.1885115505743755,null,null,"Barranquilla",21.405641808744974,11.371172830587398,17.176057655191073,15.085433803561287]
[2007,{"$f":"+'Ind de Asistencia a Cine en Col'!B19","v":0.47053045752413059},6.9006276554122223,null,null,null,null,null,null,null,null,null,null,"CARTAGENA","SI",9,2006,151816600,29555,null,"VILLAVICENCIO","SI",null,"CUCUTA",315115,575296,785197,899063,452426,460044,null,"Cúcuta",82.566999349443847,36.485739514962717,14.501583679000291,1.6838112752140688,null,null,"Bogotá",1.0659915320250946,29.919807091770451,19.591267088231461,7.6832538675730433]
[2008,{"$f":"+'Ind de Asistencia a Cine en Col'!B20","v":0.48509157705199374},3.5468048857810714,null,null,null,null,null,null,null,null,null,null,"CARTAGO",{"$error":"#N/A"},9,2006,1075000,273,null,"CUCUTA","SI",null,"FLORIDABLANCA",557098,542559,668679,668468,342586,361631,null,"Floridablanca",-2.6097742228476761,23.245398196325183,-3.1554751981147433E-2,5.5591880578891022,null,null,"Villavicencio",22.530559143112455,65.353541340769169,23.497754912152473,17.39602739231178]
[2009,{"$f":"+'Ind de Asistencia a Cine en Col'!B21","v":0.60178719180613671},1.4519196304113962,null,null,null,null,null,null,null,null,null,null,"CHIA",{"$error":"#N/A"},9,2006,69858550,10550,null,"BUCARAMANGA","SI",null,"IBAGUE",323264,334313,386467,491159,241287,261054,null,"Ibagué",3.4179494159572386,15.600350569675726,27.08950570165112,8.1923186910194232,null,null,"Valledupar",105.98022666988186,804.2417856864123,25.658874249636426,18.446195228786038]
[2010,{"$f":"+'Ind de Asistencia a Cine en Col'!B22","v":0.73951655985253573},4.3076522963759061,null,null,null,null,null,null,null,null,null,null,"CUCUTA","SI",9,2006,54550000,9453,null,"CARTAGENA","SI",null,"MANIZALES",261974,235223,313466,423529,186160,284659,null,"Manizales",-10.211318680479735,33.263328841142226,35.111622951133455,52.910936828534602,null,null,"Ibagué",3.4179494159572386,15.600350569675726,27.08950570165112,8.1923186910194232]
[null,null,null,null,null,null,null,null,null,null,null,null,null,"DUITAMA",{"$error":"#N/A"},9,2006,1119000,373,null,"BARRANQUILLA","SI",null,"MEDELLIN",2748120,2836603,3156460,3594476,1826926,1989817,null,"Medellín",3.2197647846527815,11.276058017283347,13.876811364629987,8.916124681568931,null,null,"Neiva",3.6818879073879458,15.689146888517186,27.704088221675534,35.592578146765476]
[null,null,null,null,null,null,null,null,null,null,null,null,null,"ENVIGADO",{"$error":"#N/A"},9,2006,870000,174,null,"CALI","SI",null,"NEIVA",264674,274419,317473,405426,179470,243348,null,"Neiva",3.6818879073879458,15.689146888517186,27.704088221675534,35.592578146765476,null,null,"Santa marta",3.7276736617245234,19.15963426731264,34.092506296279538,24.030365897905838]
[null,null,null,null,null,null,null,null,null,null,null,null,null,"FACATATIVA",{"$error":"#N/A"},9,2006,24000,6,null,"MEDELLIN","SI",null,"PEREIRA",532311,496377,511301,686142,345722,448820,null,"Pereira",-6.7505649892637933,3.0065857201280437,34.195317435326757,29.821070108352956,null,null,"Pereira",-6.7505649892637933,3.0065857201280437,34.195317435326757,29.821070108352956]
[null,null,null,null,null,null,null,null,null,null,null,null,null,"FLORENCIA",{"$error":"#N/A"},9,2006,2630500,780,null,"BOGOTA","SI",null,"SANTA MARTA",268237,278236,331545,444577,214978,266638,null,"Santa marta",3.7276736617245234,19.15963426731264,34.092506296279538,24.030365897905838,null,null,"Manizales",-10.211318680479735,33.263328841142226,35.111622951133455,52.910936828534602]
[null,null,"Para cambiar el tamaño del rango de datos del gráfico, arrastre la esquina inferior derecha del rango.",null,null,null,null,null,null,null,null,null,null,"FLORIDABLANCA","SI",9,2006,116189702,19724,null,null,null,null,"VALLEDUPAR",12441,25626,231721,291178,136066,161165,null,"Valledupar",105.98022666988186,804.2417856864123,25.658874249636426,18.446195228786038,null,null,"Resto",8.2682397097899099,29.668580364509779,37.186696805294361,39.885661222156898]
[null,null,null,null,null,null,null,null,null,null,null,null,null,"FUSAGASUGA",{"$error":"#N/A"},9,2006,1676000,346,null,null,null,null,"VILLAVICENCIO",316681,388031,641623,792390,387554,454973,null,"Villavicencio",22.530559143112455,65.353541340769169,23.497754912152473,17.39602739231178,null,null,"Cali",-1.642996894323872,9.1962135641485077,43.590949925795428,22.09120443545261]
[null,null,null,null,null,null,null,null,null,null,null,null,null,"GIRARDOT",{"$error":"#N/A"},9,2006,1150000,235,null,null,null,null,"RESTO",1710485,1851912,2401348,3294330,1473166,2060748,null,"Resto",8.2682397097899099,29.668580364509779,37.186696805294361,39.885661222156898,null,null,"Bucaramanga",25.66118077881157,20.996648695905577,156.16878388672313,32.17991645063978]
[null,null,null,null,null,null,null,null,null,null,null,null,null,"IBAGUE","SI",9,2006,43803875,7562]
[null,null,null,null,null,null,null,null,null,null,null,null,null,"MANIZALES","SI",9,2006,46215320,7240]
[null,null,null,null,null,null,null,null,null,null,null,null,null,"MEDELLIN","SI",9,2006,733307564,106676,null,null,null,null,"Suma de admissions","Etiquetas de columna"]
[null,null,null,null,null,null,null,null,null,null,null,null,null,"MONTERIA",{"$error":"#N/A"},9,2006,57172500,7913,null,null,null,null,null,2010,null,null,null,null,null,"Total 2010",2011,null,null,null,null,null,"Total 2011","Total general"]
[null,null,null,null,null,null,null,null,null,null,null,null,null,"NEIVA","SI",9,2006,43564077,7330,null,null,null,null,"Etiquetas de fila",1,2,3,4,5,6,null,1,2,3,4,5,6]
[null,null,null,null,null,null,null,null,null,null,null,null,null,"PALMIRA",{"$error":"#N/A"},9,2006,33141795,5294,null,null,null,null,"SI",3649257,1795385,2413255,2123038,2149154,3036445,15166534,3767955,1823721,2363418,2871155,2863124,3297772,16987145,32153679]
[null,null,null,null,null,null,null,null,null,null,null,null,null,"PASTO",{"$error":"#N/A"},9,2006,13785500,2249,null,null,null,null,"BARRANQUILLA",151756,73417,116941,108778,110757,149779,711428,168357,72296,111037,144809,157767,164484,818750,1530178]
[null,null,null,null,null,null,null,null,null,null,null,null,null,"PEREIRA","SI",9,2006,150976150,23695,null,null,null,null,"BOGOTA",1829435,899557,1236675,1046921,1049412,1526803,7588803,1822187,899945,1123616,1360743,1317808,1647571,8171870,15760673]
[null,null,null,null,null,null,null,null,null,null,null,null,null,"POPAYAN",{"$error":"#N/A"},9,2006,3300000,721,null,null,null,null,"BUCARAMANGA",63423,32184,71091,64418,71930,107011,410057,125701,56794,69383,89736,90296,110103,542013,952070]
[null,null,null,null,null,null,null,null,null,null,null,null,null,"SAN ANDRES",{"$error":"#N/A"},9,2006,3109000,583,null,null,null,null,"CALI",408010,202636,246394,213045,223753,292291,1586129,418480,220368,276706,340281,338723,341966,1936524,3522653]
[null,null,null,null,null,null,null,null,null,null,null,null,null,"SANTA MARTA","SI",9,2006,66302353,10981,null,null,null,null,"CARTAGENA",159176,73665,83821,76993,71363,91924,556942,121939,52578,78267,102533,114056,116466,585839,1142781]
[null,null,null,null,null,null,null,null,null,null,null,null,null,"SINCELEJO",{"$error":"#N/A"},9,2006,7947000,1673,null,null,null,null,"CUCUTA",111538,48629,65137,65592,68865,92665,452426,116526,49632,60396,78694,73410,81386,460044,912470]
[null,null,null,null,null,null,null,null,null,null,null,null,null,"SOGAMOSO",{"$error":"#N/A"},9,2006,1771000,470,null,null,null,null,"FLORIDABLANCA",93232,44788,50425,45313,43545,65283,342586,90607,36294,52696,58500,55664,67870,361631,704217]
[null,null,null,null,null,null,null,null,null,null,null,null,null,"TULUA",{"$error":"#N/A"},9,2006,31995500,6729,null,null,null,null,"IBAGUE",58589,27103,34469,35107,34964,51055,241287,65425,25322,33392,45625,40637,50653,261054,502341]
[null,null,null,null,null,null,null,null,null,null,null,null,null,"TUNJA",{"$error":"#N/A"},9,2006,3344500,943,null,null,null,null,"MANIZALES",44041,21026,27206,24658,29915,39314,186160,68534,31059,41069,50434,45396,48167,284659,470819]
[null,null,null,null,null,null,null,null,null,null,null,null,null,"VALLEDUPAR","SI",9,2006,1655000,461,null,null,null,null,"MEDELLIN",434990,231588,291956,254277,250106,364009,1826926,418541,220788,301712,333402,345105,370269,1989817,3816743]
[null,null,null,null,null,null,null,null,null,null,null,null,null,"VILLAVICENCIO","SI",9,2006,39927084,7132,null,null,null,null,"NEIVA",42947,18132,24244,28599,28014,37534,179470,59793,24234,35639,39944,40019,43719,243348,422818]
[null,null,null,null,null,null,null,null,null,null,null,null,null,"YOPAL",{"$error":"#N/A"},9,2006,1707000,574,null,null,null,null,"PEREIRA",85337,41276,51988,49372,49313,68436,345722,85638,46047,66700,79880,86932,83623,448820,794542]
[null,null,null,null,null,null,null,null,null,null,null,null,null,"ARMENIA",{"$error":"#N/A"},10,2006,105795800,21923,null,null,null,null,"SANTA MARTA",46848,23237,31614,31758,36958,44563,214978,62705,23738,34026,44163,50035,51971,266638,481616]
[null,null,null,null,null,null,null,null,null,null,null,null,null,"BARRANQUILLA","SI",10,2006,293708100,57835,null,null,null,null,"VALLEDUPAR",34054,14759,19630,18242,21030,28351,136066,35189,15678,20457,25212,30604,34025,161165,297231]
[null,null,null,null,null,null,null,null,null,null,null,null,null,"BELLO",{"$error":"#N/A"},10,2006,91843748,20378,null,null,null,null,"VILLAVICENCIO",85881,43388,61664,59965,59229,77427,387554,108333,48948,58322,77199,76672,85499,454973,842527]
[null,null,null,null,null,null,null,null,null,null,null,null,null,"BOGOTA","SI",10,2006,3830608302,702361,null,null,null,null,"Total general",3649257,1795385,2413255,2123038,2149154,3036445,15166534,3767955,1823721,2363418,2871155,2863124,3297772,16987145,32153679]
[null,null,null,null,null,null,null,null,null,null,null,null,null,"BUCARAMANGA","SI",10,2006,89439050,21471]
[null,null,null,null,null,null,null,null,null,null,null,null,null,"BUGA",{"$error":"#N/A"},10,2006,2310000,512]
[null,null,null,null,null,null,null,null,null,null,null,null,null,"CALI","SI",10,2006,1075019150,195779]
[null,null,null,null,null,null,null,null,null,null,null,null,null,"CARTAGENA","SI",10,2006,164988150,40934]
[null,null,null,null,null,null,null,null,null,null,null,null,null,"CARTAGO",{"$error":"#N/A"},10,2006,4255000,1171]
[null,null,null,null,null,null,null,null,null,null,null,null,null,"CHIA",{"$error":"#N/A"},10,2006,102620100,21641,null,null,null,null,"Suma de admissions","Etiquetas de columna"]
[null,null,null,null,null,null,null,null,null,null,null,null,null,"CUCUTA","SI",10,2006,68569000,15009,null,null,null,null,"Etiquetas de fila",2006,2007,2008,2009,2010,2011,"Total general"]
[null,null,null,null,null,null,null,null,null,null,null,null,null,"DUITAMA",{"$error":"#N/A"},10,2006,2976000,992,null,null,null,null,"SI",4987380,18958473,19710965,24666337,30360761,16987145,115671061]
[null,null,null,null,null,null,null,null,null,null,null,null,null,"ENVIGADO",{"$error":"#N/A"},10,2006,5020000,1004,null,null,null,null,"#N/A",410553,1710485,1851912,2401348,3294330,2060748,11729376]
[null,null,null,null,null,null,null,null,null,null,null,null,null,"FLORENCIA",{"$error":"#N/A"},10,2006,8469500,3091,null,null,null,null,"Total general",5397933,20668958,21562877,27067685,33655091,19047893,127400437]
[null,null,null,null,null,null,"Etiquetas de fila","Espectadores","Taquilla",null,null,null,null,"FLORIDABLANCA","SI",10,2006,208682578,38884]
[null,null,null,null,null,null,"Valledupar",291178,1606284900,null,null,null,null,"FUSAGASUGA",{"$error":"#N/A"},10,2006,5267000,1152]
[null,null,null,null,null,null,"Neiva",405426,2547704000,null,null,null,null,"GIRARDOT",{"$error":"#N/A"},10,2006,1550000,332]
[null,null,null,null,null,null,"Manizales",423529,2868776400,null,null,null,null,"IBAGUE","SI",10,2006,117335729,22354]
[null,null,null,null,null,null,"Santa marta",444577,2625922000,null,null,null,null,"LORICA",{"$error":"#N/A"},10,2006,225000,45]
[null,null,null,null,null,null,"Ibagué",491159,3368197200,null,null,null,null,"MANIZALES","SI",10,2006,119872776,22000]
[null,null,null,null,null,null,"Floridablanca",668468,5233671500,null,null,null,null,"MEDELLIN","SI",10,2006,1155525277,218967,null,null,null,null,"Suma de admissions","Etiquetas de columna"]
[null,null,null,null,null,null,"Pereira",686142,5374565050,null,null,null,null,"MONTERIA",{"$error":"#N/A"},10,2006,56543550,10225,null,null,null,null,null,2010,null,null,null,null,null,"Total 2010",2011,null,null,null,null,null,"Total 2011","Total general"]
[null,null,null,null,null,null,"Villavicencio",792390,4270644800,null,null,null,null,"NEIVA","SI",10,2006,114288150,22228,null,null,null,null,"Etiquetas de fila",1,2,3,4,5,6,null,1,2,3,4,5,6]
[null,null,null,null,null,null,"Cúcuta",899063,6090242800,null,null,null,null,"PALMIRA",{"$error":"#N/A"},10,2006,86939694,16105,null,null,null,null,"SI",3649257,1795385,2413255,2123038,2149154,3036445,15166534,3767955,1823721,2363418,2871155,2863124,3297772,16987145,32153679]
[null,null,null,null,null,null,"Bucaramanga",914707,4925368050,null,null,null,null,"PASTO",{"$error":"#N/A"},10,2006,20015500,4138,null,null,null,null,"#N/A",344066,154657,209004,203713,225552,336174,1473166,491658,214577,256089,343335,354289,400800,2060748,3533914]
[null,null,null,null,null,null,"Cartagena",1031028,6025308450,null,null,null,null,"PEREIRA","SI",10,2006,225302200,44932,null,null,null,null,"Total general",3993323,1950042,2622259,2326751,2374706,3372619,16639700,4259613,2038298,2619507,3214490,3217413,3698572,19047893,35687593]
[null,null,null,null,null,null,"Barranquilla",1472241,11473320950,null,null,null,null,"POPAYAN",{"$error":"#N/A"},10,2006,2596000,619]
[null,null,null,null,null,null,"Cali",3338962,26773781800,null,null,null,null,"SAN ANDRES",{"$error":"#N/A"},10,2006,4909000,797]
[null,null,null,null,null,null,"Medellín",3594476,31276043723,null,null,null,null,"SANTA MARTA","SI",10,2006,91181785,18469]
[null,null,null,null,null,null,"Bogotá",14907415,122173970670,null,null,null,null,"SINCELEJO",{"$f":"+VLOOKUP(N67,$U$2:$V$16,2,FALSE)","v":{"$error":"#N/A"}},10,2006,2885000,627]
[null,null,null,null,null,null,null,null,null,null,null,null,null,"SOGAMOSO",{"$error":"#N/A"},10,2006,6886500,1780]
[null,null,null,null,null,null,null,null,null,null,null,null,null,"TULUA",{"$error":"#N/A"},10,2006,31761000,8598]
[null,null,null,null,null,null,null,null,null,null,null,null,null,"TUNJA",{"$error":"#N/A"},10,2006,4869500,1378]
[null,null,null,null,null,null,null,null,null,null,null,null,null,"VALLEDUPAR","SI",10,2006,1443000,423]
[null,null,null,null,null,null,null,null,null,null,null,null,null,"VILLAVICENCIO","SI",10,2006,106845591,18274]
[null,null,null,null,null,null,null,null,null,null,null,null,null,"YOPAL",{"$error":"#N/A"},10,2006,888000,299]
[null,null,null,null,null,null,null,null,null,null,null,null,null,"ARMENIA",{"$error":"#N/A"},11,2006,101446850,15617]
[null,null,null,null,null,null,null,null,null,null,null,null,null,"BARRANQUILLA","SI",11,2006,395004250,58554]
[null,null,null,null,null,null,null,null,null,null,null,null,null,"BELLO",{"$error":"#N/A"},11,2006,84358008,14522]
[null,null,null,null,null,null,null,null,null,null,null,null,null,"BOGOTA","SI",11,2006,4740800350,646654]
[null,null,null,null,null,null,null,null,null,null,null,null,null,"BUCARAMANGA","SI",11,2006,81283700,14265]
[null,null,null,null,null,null,null,null,null,null,null,null,null,"BUGA",{"$error":"#N/A"},11,2006,3168000,727]
[null,null,null,null,null,null,null,null,null,null,null,null,null,"CALI","SI",11,2006,1153610850,152441]
[null,null,null,null,null,null,null,null,null,null,null,null,null,"CARTAGENA","SI",11,2006,186693600,34024]
[null,null,null,null,null,null,null,null,null,null,null,null,null,"CARTAGO",{"$error":"#N/A"},11,2006,864000,231]
[null,null,null,null,null,null,null,null,null,null,null,null,null,"CHIA",{"$error":"#N/A"},11,2006,110971200,16128]
[null,null,null,null,null,null,null,null,null,null,null,null,null,"CUCUTA","SI",11,2006,83306000,14019]
[null,null,null,null,null,null,null,null,null,null,null,null,null,"DUITAMA",{"$error":"#N/A"},11,2006,947000,307]
[null,null,null,null,null,null,null,null,null,null,null,null,null,"FLORENCIA",{"$error":"#N/A"},11,2006,5844500,1501]
[null,null,null,null,null,null,null,null,null,null,null,null,null,"FLORIDABLANCA","SI",11,2006,206743900,33385]
[null,null,null,null,null,null,null,null,null,null,null,null,null,"FUSAGASUGA",{"$error":"#N/A"},11,2006,672000,147]
[null,null,null,null,null,null,null,null,null,null,null,null,null,"GIRARDOT",{"$error":"#N/A"},11,2006,3972000,874]
[null,null,null,null,null,null,null,null,null,null,null,null,null,"IBAGUE","SI",11,2006,138712850,21961]
[null,null,null,null,null,null,null,null,null,null,null,null,null,"MANIZALES","SI",11,2006,119156100,17911]
[null,null,null,null,null,null,null,null,null,null,null,null,null,"MEDELLIN","SI",11,2006,1380246314,197027]
[null,null,null,null,null,null,null,null,null,null,null,null,null,"MONTERIA",{"$error":"#N/A"},11,2006,71164100,9672]
[null,null,null,null,null,null,null,null,null,null,null,null,null,"NEIVA","SI",11,2006,106732700,16467]
[null,null,null,null,null,null,null,null,null,null,null,null,null,"PALMIRA",{"$error":"#N/A"},11,2006,76066200,12058]
[null,null,null,null,null,null,null,null,null,null,null,null,null,"PASTO",{"$error":"#N/A"},11,2006,21738000,3473]
[null,null,null,null,null,null,null,null,null,null,null,null,null,"PEREIRA","SI",11,2006,212636800,32688]
[null,null,null,null,null,null,null,null,null,null,null,null,null,"POPAYAN",{"$error":"#N/A"},11,2006,1293000,304]
[null,null,null,null,null,null,null,null,null,null,null,null,null,"SAN ANDRES",{"$error":"#N/A"},11,2006,7194000,1233]
[null,null,null,null,null,null,null,null,null,null,null,null,null,"SANTA MARTA","SI",11,2006,100133000,16466]
[null,null,null,null,null,null,null,null,null,null,null,null,null,"SINCELEJO",{"$error":"#N/A"},11,2006,3147000,673]
[null,null,null,null,null,null,null,null,null,null,null,null,null,"SOGAMOSO",{"$error":"#N/A"},11,2006,1899000,494]
[null,null,null,null,null,null,null,null,null,null,null,null,null,"TULUA",{"$error":"#N/A"},11,2006,37558500,7974]
[null,null,null,null,null,null,null,null,null,null,null,null,null,"TUNJA",{"$error":"#N/A"},11,2006,2422000,692]
[null,null,null,null,null,null,null,null,null,null,null,null,null,"VALLEDUPAR","SI",11,2006,670000,176]
[null,null,null,null,null,null,null,null,null,null,null,null,null,"VILLAVICENCIO","SI",11,2006,86523800,14777]
[null,null,null,null,null,null,null,null,null,null,null,null,null,"YOPAL",{"$error":"#N/A"},11,2006,83000,31]
[null,null,null,null,null,null,null,null,null,null,null,null,null,"ARMENIA",{"$error":"#N/A"},12,2006,172239050,26517]
[null,null,null,null,null,null,null,null,null,null,null,null,null,"BARRANQUILLA","SI",12,2006,521313650,78460]
[null,null,null,null,null,null,null,null,null,null,null,null,null,"BELLO",{"$error":"#N/A"},12,2006,99139128,17537]
[null,null,null,null,null,null,null,null,null,null,null,null,null,"BOGOTA","SI",12,2006,5421171570,753740]
[null,null,null,null,null,null,null,null,null,null,null,null,null,"BUCARAMANGA","SI",12,2006,117753850,20476]
[null,null,null,null,null,null,null,null,null,null,null,null,null,"BUGA",{"$error":"#N/A"},12,2006,6926000,1979]
[null,null,null,null,null,null,null,null,null,null,null,null,null,"CALI","SI",12,2006,1355443500,178197]
[null,null,null,null,null,null,null,null,null,null,null,null,null,"CARTAGENA","SI",12,2006,280071050,51011]
[null,null,null,null,null,null,null,null,null,null,null,null,null,"CARTAGO",{"$error":"#N/A"},12,2006,2593000,609]
[null,null,null,null,null,null,null,null,null,null,null,null,null,"CHIA",{"$error":"#N/A"},12,2006,189130750,27200]
[null,null,null,null,null,null,null,null,null,null,null,null,null,"CUCUTA","SI",12,2006,107525000,18230]
[null,null,null,null,null,null,null,null,null,null,null,null,null,"DUITAMA",{"$error":"#N/A"},12,2006,1959000,653]
[null,null,null,null,null,null,null,null,null,null,null,null,null,"ENVIGADO",{"$error":"#N/A"},12,2006,2324000,397]
[null,null,null,null,null,null,null,null,null,null,null,null,null,"FLORENCIA",{"$error":"#N/A"},12,2006,9542000,1943]
[null,null,null,null,null,null,null,null,null,null,null,null,null,"FLORIDABLANCA","SI",12,2006,316911200,51203]
[null,null,null,null,null,null,null,null,null,null,null,null,null,"FUSAGASUGA",{"$error":"#N/A"},12,2006,1524000,339]
[null,null,null,null,null,null,null,null,null,null,null,null,null,"GIRARDOT",{"$error":"#N/A"},12,2006,3921000,731]
[null,null,null,null,null,null,null,null,null,null,null,null,null,"IBAGUE","SI",12,2006,189849350,30988]
[null,null,null,null,null,null,null,null,null,null,null,null,null,"LORICA",{"$error":"#N/A"},12,2006,75000,15]
[null,null,null,null,null,null,null,null,null,null,null,null,null,"MANIZALES","SI",12,2006,143887170,22756]
[null,null,null,null,null,null,null,null,null,null,null,null,null,"MEDELLIN","SI",12,2006,1516641095,222357]
[null,null,null,null,null,null,null,null,null,null,null,null,null,"MONTERIA",{"$error":"#N/A"},12,2006,112202350,15487]
[null,null,null,null,null,null,null,null,null,null,null,null,null,"NEIVA","SI",12,2006,157551500,25997]
[null,null,null,null,null,null,null,null,null,null,null,null,null,"PALMIRA",{"$f":"+VLOOKUP(N131,$U$2:$V$16,2,FALSE)","v":{"$error":"#N/A"}},12,2006,108026550,17206]
[null,null,null,null,null,null,null,null,null,null,null,null,null,"PASTO",{"$error":"#N/A"},12,2006,39479500,6504]
[null,null,null,null,null,null,null,null,null,null,null,null,null,"PEREIRA","SI",12,2006,318672600,49102]
[null,null,null,null,null,null,null,null,null,null,null,null,null,"POPAYAN",{"$error":"#N/A"},12,2006,4428000,1052]
[null,null,null,null,null,null,null,null,null,null,null,null,null,"SAN ANDRES",{"$error":"#N/A"},12,2006,15934000,2485]
[null,null,null,null,null,null,null,null,null,null,null,null,null,"SANTA MARTA","SI",12,2006,149521900,24834]
[null,null,null,null,null,null,null,null,null,null,null,null,null,"SINCELEJO",{"$error":"#N/A"},12,2006,6265500,1425]
[null,null,null,null,null,null,null,null,null,null,null,null,null,"SOGAMOSO",{"$error":"#N/A"},12,2006,4148000,1102]
[null,null,null,null,null,null,null,null,null,null,null,null,null,"TULUA",{"$error":"#N/A"},12,2006,43546500,9420]
[null,null,null,null,null,null,null,null,null,null,null,null,null,"TUNJA",{"$error":"#N/A"},12,2006,6912500,1891]
[null,null,null,null,null,null,null,null,null,null,null,null,null,"VALLEDUPAR","SI",12,2006,3697500,889]
[null,null,null,null,null,null,null,null,null,null,null,null,null,"VILLAVICENCIO","SI",12,2006,94821500,16846]
[null,null,null,null,null,null,null,null,null,null,null,null,null,"YOPAL",{"$error":"#N/A"},12,2006,997500,348]
[null,null,null,null,null,null,null,null,null,null,null,null,null,"ARMENIA",{"$error":"#N/A"},1,2007,225720050,31709]
[null,null,null,null,null,null,null,null,null,null,null,null,null,"BARRANQUILLA","SI",1,2007,613413550,88389]
[null,null,null,null,null,null,null,null,null,null,null,null,null,"BELLO",{"$error":"#N/A"},1,2007,145079700,23575]
[null,null,null,null,null,null,null,null,null,null,null,null,null,"BOGOTA","SI",1,2007,7765143000,1035824]
[null,null,null,null,null,null,null,null,null,null,null,null,null,"BUCARAMANGA","SI",1,2007,157823200,25156]
[null,null,null,null,null,null,null,null,null,null,null,null,null,"BUGA",{"$error":"#N/A"},1,2007,13661000,3020]
[null,null,null,null,null,null,null,null,null,null,null,null,null,"CALI","SI",1,2007,1991421800,247012]
[null,null,null,null,null,null,null,null,null,null,null,null,null,"CARTAGENA","SI",1,2007,320969700,50945]
[null,null,null,null,null,null,null,null,null,null,null,null,null,"CARTAGO",{"$error":"#N/A"},1,2007,3912000,1070]
[null,null,null,null,null,null,null,null,null,null,null,null,null,"CHIA",{"$error":"#N/A"},1,2007,248174200,33958]
[null,null,null,null,null,null,null,null,null,null,null,null,null,"CUCUTA","SI",1,2007,182545000,27521]
[null,null,null,null,null,null,null,null,null,null,null,null,null,"DUITAMA",{"$error":"#N/A"},1,2007,1563000,521]
[null,null,null,null,null,null,null,null,null,null,null,null,null,"ENVIGADO",{"$error":"#N/A"},1,2007,6097000,1026]
[null,null,null,null,null,null,null,null,null,null,null,null,null,"FLORENCIA",{"$error":"#N/A"},1,2007,11193000,2494]
[null,null,null,null,null,null,null,null,null,null,null,null,null,"FLORIDABLANCA","SI",1,2007,454486950,66971]
[null,null,null,null,null,null,null,null,null,null,null,null,null,"FUSAGASUGA",{"$error":"#N/A"},1,2007,1598000,351]
[null,null,null,null,null,null,null,null,null,null,null,null,null,"GIRARDOT",{"$error":"#N/A"},1,2007,5980000,1281]
[null,null,null,null,null,null,null,null,null,null,null,null,null,"IBAGUE","SI",1,2007,289502300,43204]
[null,null,null,null,null,null,null,null,null,null,null,null,null,"LORICA",{"$error":"#N/A"},1,2007,679000,148]
[null,null,null,null,null,null,null,null,null,null,null,null,null,"MANIZALES","SI",1,2007,199562600,29638]
[null,null,null,null,null,null,null,null,null,null,null,null,null,"MARINILLA",{"$error":"#N/A"},1,2007,672000,224]
[null,null,null,null,null,null,null,null,null,null,null,null,null,"MEDELLIN","SI",1,2007,2113737200,297193]
[null,null,null,null,null,null,null,null,null,null,null,null,null,"MELGAR",{"$error":"#N/A"},1,2007,0,0]
[null,null,null,null,null,null,null,null,null,null,null,null,null,"MONTERIA",{"$error":"#N/A"},1,2007,135301550,16696]
[null,null,null,null,null,null,null,null,null,null,null,null,null,"NEIVA","SI",1,2007,202578650,30949]
[null,null,null,null,null,null,null,null,null,null,null,null,null,"PALMIRA",{"$error":"#N/A"},1,2007,163783900,24789]
[null,null,null,null,null,null,null,null,null,null,null,null,null,"PASTO",{"$error":"#N/A"},1,2007,65432500,11090]
[null,null,null,null,null,null,null,null,null,null,null,null,null,"PEREIRA","SI",1,2007,452158050,63207]
[null,null,null,null,null,null,null,null,null,null,null,null,null,"POPAYAN",{"$error":"#N/A"},1,2007,6586000,1458]
[null,null,null,null,null,null,null,null,null,null,null,null,null,"SAN ANDRES",{"$error":"#N/A"},1,2007,25140000,3620]
[null,null,null,null,null,null,null,null,null,null,null,null,null,"SANTA MARTA","SI",1,2007,197526850,30506]
[null,null,null,null,null,null,null,null,null,null,null,null,null,"SINCELEJO",{"$error":"#N/A"},1,2007,5720000,1257]
[null,null,null,null,null,null,null,null,null,null,null,null,null,"SOGAMOSO",{"$error":"#N/A"},1,2007,7290500,1983]
[null,null,null,null,null,null,null,null,null,null,null,null,null,"TULUA",{"$error":"#N/A"},1,2007,74337000,12947]
[null,null,null,null,null,null,null,null,null,null,null,null,null,"TUNJA",{"$error":"#N/A"},1,2007,7790500,2180]
[null,null,null,null,null,null,null,null,null,null,null,null,null,"VALLEDUPAR","SI",1,2007,3714000,968]
[null,null,null,null,null,null,null,null,null,null,null,null,null,"VILLAVICENCIO","SI",1,2007,136193000,24393]
[null,null,null,null,null,null,null,null,null,null,null,null,null,"YOPAL",{"$error":"#N/A"},1,2007,2411000,839]
[null,null,null,null,null,null,null,null,null,null,null,null,null,"ARMENIA",{"$error":"#N/A"},2,2007,77100100,10861]
[null,null,null,null,null,null,null,null,null,null,null,null,null,"BARRANQUILLA","SI",2,2007,295416450,40354]
[null,null,null,null,null,null,null,null,null,null,null,null,null,"BELLO",{"$error":"#N/A"},2,2007,65435005,10098]
[null,null,null,null,null,null,null,null,null,null,null,null,null,"BOGOTA","SI",2,2007,4268542950,540656]
[null,null,null,null,null,null,null,null,null,null,null,null,null,"BUCARAMANGA","SI",2,2007,61219950,9530]
[null,null,null,null,null,null,null,null,null,null,null,null,null,"BUGA",{"$error":"#N/A"},2,2007,5109000,1202]
[null,null,null,null,null,null,null,null,null,null,null,null,null,"CALI","SI",2,2007,1059563800,130644]
[null,null,null,null,null,null,null,null,null,null,null,null,null,"CARTAGENA","SI",2,2007,149290900,23188]
[null,null,null,null,null,null,null,null,null,null,null,null,null,"CARTAGO",{"$error":"#N/A"},2,2007,2820000,814]
[null,null,null,null,null,null,null,null,null,null,null,null,null,"CHIA",{"$error":"#N/A"},2,2007,108073000,14329]
[null,null,null,null,null,null,null,null,null,null,null,null,null,"CUCUTA","SI",2,2007,62805000,9243]
[null,null,null,null,null,null,null,null,null,null,null,null,null,"DUITAMA",{"$error":"#N/A"},2,2007,1365000,455]
[null,null,null,null,null,null,null,null,null,null,null,null,null,"ENVIGADO",{"$error":"#N/A"},2,2007,1466000,248]
[null,null,null,null,null,null,null,null,null,null,null,null,null,"FLORENCIA",{"$f":"+VLOOKUP(N195,$U$2:$V$16,2,FALSE)","v":{"$error":"#N/A"}},2,2007,6554500,1625]
[null,null,null,null,null,null,null,null,null,null,null,null,null,"FLORIDABLANCA","SI",2,2007,188679200,28448]
[null,null,null,null,null,null,null,null,null,null,null,null,null,"FUSAGASUGA",{"$error":"#N/A"},2,2007,2026000,429]
[null,null,null,null,null,null,null,null,null,null,null,null,null,"GIRARDOT",{"$error":"#N/A"},2,2007,1861000,404]
[null,null,null,null,null,null,null,null,null,null,null,null,null,"IBAGUE","SI",2,2007,93905600,14282]
[null,null,null,null,null,null,null,null,null,null,null,null,null,"LORICA",{"$error":"#N/A"},2,2007,452000,115]
[null,null,null,null,null,null,null,null,null,null,null,null,null,"MANIZALES","SI",2,2007,100375300,15127]
[null,null,null,null,null,null,null,null,null,null,null,null,null,"MARINILLA",{"$error":"#N/A"},2,2007,335000,108]
[null,null,null,null,null,null,null,null,null,null,null,null,null,"MEDELLIN","SI",2,2007,1316151721,179293]
[null,null,null,null,null,null,null,null,null,null,null,null,null,"MONTERIA",{"$error":"#N/A"},2,2007,57661100,6739]
[null,null,null,null,null,null,null,null,null,null,null,null,null,"NEIVA","SI",2,2007,88441850,14019]
[null,null,null,null,null,null,null,null,null,null,null,null,null,"PALMIRA",{"$error":"#N/A"},2,2007,65455150,10156]
[null,null,null,null,null,null,null,null,null,null,null,null,null,"PASTO",{"$error":"#N/A"},2,2007,40012000,6966]
[null,null,null,null,null,null,null,null,null,null,null,null,null,"PEREIRA","SI",2,2007,172920200,23947]
[null,null,null,null,null,null,null,null,null,null,null,null,null,"POPAYAN",{"$error":"#N/A"},2,2007,4254000,1026]
[null,null,null,null,null,null,null,null,null,null,null,null,null,"SAN ANDRES",{"$error":"#N/A"},2,2007,10256000,1630]
[null,null,null,null,null,null,null,null,null,null,null,null,null,"SANTA MARTA","SI",2,2007,83294200,13433]
[null,null,null,null,null,null,null,null,null,null,null,null,null,"SINCELEJO",{"$error":"#N/A"},2,2007,4379000,902]
[null,null,null,null,null,null,null,null,null,null,null,null,null,"SOGAMOSO",{"$error":"#N/A"},2,2007,3399500,893]
[null,null,null,null,null,null,null,null,null,null,null,null,null,"TULUA",{"$error":"#N/A"},2,2007,35156000,5995]
[null,null,null,null,null,null,null,null,null,null,null,null,null,"TUNJA",{"$error":"#N/A"},2,2007,4021000,1091]
[null,null,null,null,null,null,null,null,null,null,null,null,null,"VALLEDUPAR","SI",2,2007,1068000,267]
[null,null,null,null,null,null,null,null,null,null,null,null,null,"VILLAVICENCIO","SI",2,2007,62003500,10116]
[null,null,null,null,null,null,null,null,null,null,null,null,null,"YOPAL",{"$error":"#N/A"},2,2007,1099500,368]
[null,null,null,null,null,null,null,null,null,null,null,null,null,"ARMENIA",{"$error":"#N/A"},3,2007,118043900,16347]
[null,null,null,null,null,null,null,null,null,null,null,null,null,"BARRANQUILLA","SI",3,2007,439730600,58757]
[null,null,null,null,null,null,null,null,null,null,null,null,null,"BELLO",{"$error":"#N/A"},3,2007,74970300,11611]
[null,null,null,null,null,null,null,null,null,null,null,null,null,"BOGOTA","SI",3,2007,5126614050,651459]
[null,null,null,null,null,null,null,null,null,null,null,null,null,"BUCARAMANGA","SI",3,2007,75021200,11696]
[null,null,null,null,null,null,null,null,null,null,null,null,null,"BUGA",{"$error":"#N/A"},3,2007,5977000,1407]
[null,null,null,null,null,null,null,null,null,null,null,null,null,"CALI","SI",3,2007,1222043950,150466]
[null,null,null,null,null,null,null,null,null,null,null,null,null,"CARTAGENA","SI",3,2007,195071650,30226]
[null,null,null,null,null,null,null,null,null,null,null,null,null,"CARTAGO",{"$error":"#N/A"},3,2007,1306000,402]
[null,null,null,null,null,null,null,null,null,null,null,null,null,"CHIA",{"$error":"#N/A"},3,2007,132721450,17631]
[null,null,null,null,null,null,null,null,null,null,null,null,null,"CUCUTA","SI",3,2007,82774000,11819]
[null,null,null,null,null,null,null,null,null,null,null,null,null,"DUITAMA",{"$error":"#N/A"},3,2007,1806000,602]
[null,null,null,null,null,null,null,null,null,null,null,null,null,"ENVIGADO",{"$error":"#N/A"},3,2007,2532000,422]
[null,null,null,null,null,null,null,null,null,null,null,null,null,"FLORENCIA",{"$error":"#N/A"},3,2007,6886500,2337]
[null,null,null,null,null,null,null,null,null,null,null,null,null,"FLORIDABLANCA","SI",3,2007,219565200,32199]
[null,null,null,null,null,null,null,null,null,null,null,null,null,"FUSAGASUGA",{"$error":"#N/A"},3,2007,704000,151]
[null,null,null,null,null,null,null,null,null,null,null,null,null,"GIRARDOT",{"$error":"#N/A"},3,2007,3134000,647]
[null,null,null,null,null,null,null,null,null,null,null,null,null,"IBAGUE","SI",3,2007,107408850,15960]
[null,null,null,null,null,null,null,null,null,null,null,null,null,"LORICA",{"$error":"#N/A"},3,2007,388000,97]
[null,null,null,null,null,null,null,null,null,null,null,null,null,"MANIZALES","SI",3,2007,113459150,17046]
[null,null,null,null,null,null,null,null,null,null,null,null,null,"MARINILLA",{"$error":"#N/A"},3,2007,986000,302]
[null,null,null,null,null,null,null,null,null,null,null,null,null,"MEDELLIN","SI",3,2007,1446429462,196828]
[null,null,null,null,null,null,null,null,null,null,null,null,null,"MELGAR",{"$error":"#N/A"},3,2007,90000,18]
[null,null,null,null,null,null,null,null,null,null,null,null,null,"MONTERIA",{"$error":"#N/A"},3,2007,80845750,9401]
[null,null,null,null,null,null,null,null,null,null,null,null,null,"NEIVA","SI",3,2007,91630450,14010]
[null,null,null,null,null,null,null,null,null,null,null,null,null,"PALMIRA",{"$error":"#N/A"},3,2007,83393600,12753]
[null,null,null,null,null,null,null,null,null,null,null,null,null,"PASTO",{"$error":"#N/A"},3,2007,39283000,6945]
[null,null,null,null,null,null,null,null,null,null,null,null,null,"PEREIRA","SI",3,2007,256430750,35078]
[null,null,null,null,null,null,null,null,null,null,null,null,null,"POPAYAN",{"$error":"#N/A"},3,2007,4209000,957]
[null,null,null,null,null,null,null,null,null,null,null,null,null,"SAN ANDRES",{"$error":"#N/A"},3,2007,11360000,1778]
[null,null,null,null,null,null,null,null,null,null,null,null,null,"SANTA MARTA","SI",3,2007,105046700,15926]
[null,null,null,null,null,null,null,null,null,null,null,null,null,"SINCELEJO",{"$error":"#N/A"},3,2007,8168000,1785]
[null,null,null,null,null,null,null,null,null,null,null,null,null,"SOGAMOSO",{"$error":"#N/A"},3,2007,2951000,757]
[null,null,null,null,null,null,null,null,null,null,null,null,null,"TULUA",{"$error":"#N/A"},3,2007,40106000,6630]
[null,null,null,null,null,null,null,null,null,null,null,null,null,"TUNJA",{"$error":"#N/A"},3,2007,4940000,1324]
[null,null,null,null,null,null,null,null,null,null,null,null,null,"VALLEDUPAR","SI",3,2007,2127000,538]
[null,null,null,null,null,null,null,null,null,null,null,null,null,"VILLAVICENCIO","SI",3,2007,82826500,13997]
[null,null,null,null,null,null,null,null,null,null,null,null,null,"YOPAL",{"$error":"#N/A"},3,2007,744500,253]
[null,null,null,null,null,null,null,null,null,null,null,null,null,"ARMENIA",{"$error":"#N/A"},4,2007,170144250,24578]
[null,null,null,null,null,null,null,null,null,null,null,null,null,"BARRANQUILLA","SI",4,2007,596111950,83970]
[null,null,null,null,null,null,null,null,null,null,null,null,null,"BELLO",{"$f":"+VLOOKUP(N259,$U$2:$V$16,2,FALSE)","v":{"$error":"#N/A"}},4,2007,118044500,19298]
[null,null,null,null,null,null,null,null,null,null,null,null,null,"BOGOTA","SI",4,2007,6300989400,853533]
[null,null,null,null,null,null,null,null,null,null,null,null,null,"BUCARAMANGA","SI",4,2007,114683750,19382]
[null,null,null,null,null,null,null,null,null,null,null,null,null,"BUGA",{"$error":"#N/A"},4,2007,9296000,2046]
[null,null,null,null,null,null,null,null,null,null,null,null,null,"CALI","SI",4,2007,1637175800,209727]
[null,null,null,null,null,null,null,null,null,null,null,null,null,"CARTAGENA","SI",4,2007,316202150,51394]
[null,null,null,null,null,null,null,null,null,null,null,null,null,"CARTAGO",{"$error":"#N/A"},4,2007,2756000,728]
[null,null,null,null,null,null,null,null,null,null,null,null,null,"CHIA",{"$error":"#N/A"},4,2007,197885000,27928]
[null,null,null,null,null,null,null,null,null,null,null,null,null,"CUCUTA","SI",4,2007,119409000,18620]
[null,null,null,null,null,null,null,null,null,null,null,null,null,"DUITAMA",{"$error":"#N/A"},4,2007,1488000,496]
[null,null,null,null,null,null,null,null,null,null,null,null,null,"ENVIGADO",{"$error":"#N/A"},4,2007,6366000,1061]
[null,null,null,null,null,null,null,null,null,null,null,null,null,"FLORENCIA",{"$error":"#N/A"},4,2007,8669000,1915]
[null,null,null,null,null,null,null,null,null,null,null,null,null,"FLORIDABLANCA","SI",4,2007,308758500,45642]
[null,null,null,null,null,null,null,null,null,null,null,null,null,"FUSAGASUGA",{"$error":"#N/A"},4,2007,568000,128]
[null,null,null,null,null,null,null,null,null,null,null,null,null,"GIRARDOT",{"$error":"#N/A"},4,2007,7362000,1560]
[null,null,null,null,null,null,null,null,null,null,null,null,null,"IBAGUE","SI",4,2007,182293650,27276]
[null,null,null,null,null,null,null,null,null,null,null,null,null,"LORICA",{"$error":"#N/A"},4,2007,260000,65]
[null,null,null,null,null,null,null,null,null,null,null,null,null,"MANIZALES","SI",4,2007,156050300,23210]
[null,null,null,null,null,null,null,null,null,null,null,null,null,"MARINILLA",{"$error":"#N/A"},4,2007,1080000,360]
[null,null,null,null,null,null,null,null,null,null,null,null,null,"MEDELLIN","SI",4,2007,1883549300,264813]
[null,null,null,null,null,null,null,null,null,null,null,null,null,"MELGAR",{"$error":"#N/A"},4,2007,3911000,793]
[null,null,null,null,null,null,null,null,null,null,null,null,null,"MONTERIA",{"$error":"#N/A"},4,2007,123905150,15616]
[null,null,null,null,null,null,null,null,null,null,null,null,null,"NEIVA","SI",4,2007,148818600,22784]
[null,null,null,null,null,null,null,null,null,null,null,null,null,"PALMIRA",{"$error":"#N/A"},4,2007,119557200,18152]
[null,null,null,null,null,null,null,null,null,null,null,null,null,"PASTO",{"$error":"#N/A"},4,2007,59142000,10996]
[null,null,null,null,null,null,null,null,null,null,null,null,null,"PEREIRA","SI",4,2007,355097550,50240]
[null,null,null,null,null,null,null,null,null,null,null,null,null,"POPAYAN",{"$error":"#N/A"},4,2007,7775000,1699]
[null,null,null,null,null,null,null,null,null,null,null,null,null,"SAN ANDRES",{"$error":"#N/A"},4,2007,19478000,3118]
[null,null,null,null,null,null,null,null,null,null,null,null,null,"SANTA MARTA","SI",4,2007,142766850,21787]
[null,null,null,null,null,null,null,null,null,null,null,null,null,"SINCELEJO",{"$error":"#N/A"},4,2007,7978000,1756]
[null,null,null,null,null,null,null,null,null,null,null,null,null,"SOGAMOSO",{"$error":"#N/A"},4,2007,4852500,1259]
[null,null,null,null,null,null,null,null,null,null,null,null,null,"TULUA",{"$error":"#N/A"},4,2007,59412000,10168]
[null,null,null,null,null,null,null,null,null,null,null,null,null,"TUNJA",{"$error":"#N/A"},4,2007,6054000,1657]
[null,null,null,null,null,null,null,null,null,null,null,null,null,"VALLEDUPAR","SI",4,2007,3738000,951]
[null,null,null,null,null,null,null,null,null,null,null,null,null,"VILLAVICENCIO","SI",4,2007,128570500,22326]
[null,null,null,null,null,null,null,null,null,null,null,null,null,"YOPAL",{"$error":"#N/A"},4,2007,1551000,531]
[null,null,null,null,null,null,null,null,null,null,null,null,null,"ARMENIA",{"$error":"#N/A"},5,2007,167055500,23245]
[null,null,null,null,null,null,null,null,null,null,null,null,null,"BARRANQUILLA","SI",5,2007,625047550,85903]
[null,null,null,null,null,null,null,null,null,null,null,null,null,"BELLO",{"$error":"#N/A"},5,2007,101425900,16479]
[null,null,null,null,null,null,null,null,null,null,null,null,null,"BOGOTA","SI",5,2007,6388744400,848142]
[null,null,null,null,null,null,null,null,null,null,null,null,null,"BUCARAMANGA","SI",5,2007,158231050,26247]
[null,null,null,null,null,null,null,null,null,null,null,null,null,"BUGA",{"$error":"#N/A"},5,2007,36093000,7603]
[null,null,null,null,null,null,null,null,null,null,null,null,null,"CALI","SI",5,2007,1604675400,202274]
[null,null,null,null,null,null,null,null,null,null,null,null,null,"CARTAGENA","SI",5,2007,387331650,60456]
[null,null,null,null,null,null,null,null,null,null,null,null,null,"CARTAGO",{"$error":"#N/A"},5,2007,3609000,939]
[null,null,null,null,null,null,null,null,null,null,null,null,null,"CHIA",{"$error":"#N/A"},5,2007,199316550,26980]
[null,null,null,null,null,null,null,null,null,null,null,null,null,"CUCUTA","SI",5,2007,159750000,23398]
[null,null,null,null,null,null,null,null,null,null,null,null,null,"DUITAMA",{"$error":"#N/A"},5,2007,1425000,475]
[null,null,null,null,null,null,null,null,null,null,null,null,null,"ENVIGADO",{"$error":"#N/A"},5,2007,4224000,704]
[null,null,null,null,null,null,null,null,null,null,null,null,null,"FLORENCIA",{"$error":"#N/A"},5,2007,34188000,7043]
[null,null,null,null,null,null,null,null,null,null,null,null,null,"FLORIDABLANCA","SI",5,2007,322374600,47430]
[null,null,null,null,null,null,null,null,null,null,null,null,null,"FUSAGASUGA",{"$error":"#N/A"},5,2007,2089000,447]
[null,null,null,null,null,null,null,null,null,null,null,null,null,"GIRARDOT",{"$error":"#N/A"},5,2007,13425500,2222]
[null,null,null,null,null,null,null,null,null,null,null,null,null,"IBAGUE","SI",5,2007,201393750,29840]
[null,null,null,null,null,null,null,null,null,null,null,null,null,"LORICA",{"$error":"#N/A"},5,2007,1364000,341]
[null,null,null,null,null,null,null,null,null,null,null,null,null,"MANIZALES","SI",5,2007,170464400,25165]
[null,null,null,null,null,null,null,null,null,null,null,null,null,"MARINILLA",{"$error":"#N/A"},5,2007,324000,108]
[null,null,null,null,null,null,null,null,null,null,null,null,null,"MEDELLIN","SI",5,2007,1728122550,239526]
[null,null,null,null,null,null,null,null,null,null,null,null,null,"MELGAR",{"$error":"#N/A"},5,2007,1470000,294]
[null,null,null,null,null,null,null,null,null,null,null,null,null,"MONTERIA",{"$error":"#N/A"},5,2007,137097600,16918]
[null,null,null,null,null,null,null,null,null,null,null,null,null,"NEIVA","SI",5,2007,173777200,26991]
[null,null,null,null,null,null,null,null,null,null,null,null,null,"PALMIRA",{"$error":"#N/A"},5,2007,137786000,20574]
[null,null,null,null,null,null,null,null,null,null,null,null,null,"PASTO",{"$error":"#N/A"},5,2007,117732000,21059]
[null,null,null,null,null,null,null,null,null,null,null,null,null,"PEREIRA","SI",5,2007,368535100,51690]
[null,null,null,null,null,null,null,null,null,null,null,null,null,"POPAYAN",{"$f":"+VLOOKUP(N323,$U$2:$V$16,2,FALSE)","v":{"$error":"#N/A"}},5,2007,20460000,4295]
[null,null,null,null,null,null,null,null,null,null,null,null,null,"SAN ANDRES",{"$error":"#N/A"},5,2007,32276000,4754]
[null,null,null,null,null,null,null,null,null,null,null,null,null,"SANTA MARTA","SI",5,2007,190850400,28593]
[null,null,null,null,null,null,null,null,null,null,null,null,null,"SINCELEJO",{"$error":"#N/A"},5,2007,13667000,2888]
[null,null,null,null,null,null,null,null,null,null,null,null,null,"SOGAMOSO",{"$error":"#N/A"},5,2007,18819000,4937]
[null,null,null,null,null,null,null,null,null,null,null,null,null,"TULUA",{"$error":"#N/A"},5,2007,92706000,16248]
[null,null,null,null,null,null,null,null,null,null,null,null,null,"TUNJA",{"$error":"#N/A"},5,2007,25766000,6625]
[null,null,null,null,null,null,null,null,null,null,null,null,null,"VALLEDUPAR","SI",5,2007,10729000,2707]
[null,null,null,null,null,null,null,null,null,null,null,null,null,"VILLAVICENCIO","SI",5,2007,187380000,32406]
[null,null,null,null,null,null,null,null,null,null,null,null,null,"YOPAL",{"$error":"#N/A"},5,2007,5010500,1690]
[null,null,null,null,null,null,null,null,null,null,null,null,null,"ARMENIA",{"$error":"#N/A"},6,2007,198282450,28422]
[null,null,null,null,null,null,null,null,null,null,null,null,null,"BARRANQUILLA","SI",6,2007,691518150,97650]
[null,null,null,null,null,null,null,null,null,null,null,null,null,"BELLO",{"$error":"#N/A"},6,2007,152487000,24711]
[null,null,null,null,null,null,null,null,null,null,null,null,null,"BOGOTA","SI",6,2007,8480823400,1137882]
[null,null,null,null,null,null,null,null,null,null,null,null,null,"BUCARAMANGA","SI",6,2007,179995950,29898]
[null,null,null,null,null,null,null,null,null,null,null,null,null,"BUGA",{"$error":"#N/A"},6,2007,17296000,3584]
[null,null,null,null,null,null,null,null,null,null,null,null,null,"CALI","SI",6,2007,1893758450,241751]
[null,null,null,null,null,null,null,null,null,null,null,null,null,"CARTAGENA","SI",6,2007,374799900,59676]
[null,null,null,null,null,null,null,null,null,null,null,null,null,"CARTAGO",{"$error":"#N/A"},6,2007,6442000,1679]
[null,null,null,null,null,null,null,null,null,null,null,null,null,"CHIA",{"$error":"#N/A"},6,2007,280023000,38643]
[null,null,null,null,null,null,null,null,null,null,null,null,null,"CUCUTA","SI",6,2007,172554000,25428]
[null,null,null,null,null,null,null,null,null,null,null,null,null,"DUITAMA",{"$error":"#N/A"},6,2007,3450000,1150]
[null,null,null,null,null,null,null,null,null,null,null,null,null,"ENVIGADO",{"$error":"#N/A"},6,2007,2028000,338]
[null,null,null,null,null,null,null,null,null,null,null,null,null,"FLORENCIA",{"$error":"#N/A"},6,2007,18248500,3963]
[null,null,null,null,null,null,null,null,null,null,null,null,null,"FLORIDABLANCA","SI",6,2007,435980750,64176]
[null,null,null,null,null,null,null,null,null,null,null,null,null,"FUSAGASUGA",{"$error":"#N/A"},6,2007,4007000,856]
[null,null,null,null,null,null,null,null,null,null,null,null,null,"GIRARDOT",{"$error":"#N/A"},6,2007,11962000,1947]
[null,null,null,null,null,null,null,null,null,null,null,null,null,"IBAGUE","SI",6,2007,236476900,34946]
[null,null,null,null,null,null,null,null,null,null,null,null,null,"LORICA",{"$error":"#N/A"},6,2007,1216000,304]
[null,null,null,null,null,null,null,null,null,null,null,null,null,"MANIZALES","SI",6,2007,209970100,30980]
[null,null,null,null,null,null,null,null,null,null,null,null,null,"MARINILLA",{"$error":"#N/A"},6,2007,1353000,451]
[null,null,null,null,null,null,null,null,null,null,null,null,null,"MEDELLIN","SI",6,2007,2180883623,306258]
[null,null,null,null,null,null,null,null,null,null,null,null,null,"MELGAR",{"$error":"#N/A"},6,2007,3095000,669]
[null,null,null,null,null,null,null,null,null,null,null,null,null,"MONTERIA",{"$error":"#N/A"},6,2007,143234500,17792]
[null,null,null,null,null,null,null,null,null,null,null,null,null,"NEIVA","SI",6,2007,169154650,25500]
[null,null,null,null,null,null,null,null,null,null,null,null,null,"PALMIRA",{"$error":"#N/A"},6,2007,154282300,22951]
[null,null,null,null,null,null,null,null,null,null,null,null,null,"PASTO",{"$error":"#N/A"},6,2007,84014000,15079]
[null,null,null,null,null,null,null,null,null,null,null,null,null,"PEREIRA","SI",6,2007,418872500,59329]
[null,null,null,null,null,null,null,null,null,null,null,null,null,"POPAYAN",{"$error":"#N/A"},6,2007,11614000,2431]
[null,null,null,null,null,null,null,null,null,null,null,null,null,"SAN ANDRES",{"$error":"#N/A"},6,2007,21065000,3553]
[null,null,null,null,null,null,null,null,null,null,null,null,null,"SANTA MARTA","SI",6,2007,186720900,27955]
[null,null,null,null,null,null,null,null,null,null,null,null,null,"SINCELEJO",{"$error":"#N/A"},6,2007,11888000,2519]
[null,null,null,null,null,null,null,null,null,null,null,null,null,"SOGAMOSO",{"$error":"#N/A"},6,2007,25473000,5821]
[null,null,null,null,null,null,null,null,null,null,null,null,null,"TULUA",{"$error":"#N/A"},6,2007,70418000,12277]
[null,null,null,null,null,null,null,null,null,null,null,null,null,"TUNJA",{"$error":"#N/A"},6,2007,25884000,6516]
[null,null,null,null,null,null,null,null,null,null,null,null,null,"VALLEDUPAR","SI",6,2007,6619000,1670]
[null,null,null,null,null,null,null,null,null,null,null,null,null,"VILLAVICENCIO","SI",6,2007,288270500,45263]
[null,null,null,null,null,null,null,null,null,null,null,null,null,"YOPAL",{"$error":"#N/A"},6,2007,7595000,2537]
[null,null,null,null,null,null,null,null,null,null,null,null,null,"ARMENIA",{"$error":"#N/A"},7,2007,265420700,37780]
[null,null,null,null,null,null,null,null,null,null,null,null,null,"BARRANQUILLA","SI",7,2007,979840700,140199]
[null,null,null,null,null,null,null,null,null,null,null,null,null,"BELLO",{"$error":"#N/A"},7,2007,174744400,29596]
[null,null,null,null,null,null,null,null,null,null,null,null,null,"BOGOTA","SI",7,2007,10032484058,1351380]
[null,null,null,null,null,null,null,null,null,null,null,null,null,"BUCARAMANGA","SI",7,2007,226775550,37609]
[null,null,null,null,null,null,null,null,null,null,null,null,null,"BUGA",{"$error":"#N/A"},7,2007,32438000,6739]
[null,null,null,null,null,null,null,null,null,null,null,null,null,"CALI","SI",7,2007,2440830750,315872]
[null,null,null,null,null,null,null,null,null,null,null,null,null,"CARTAGENA","SI",7,2007,503418950,81688]
[null,null,null,null,null,null,null,null,null,null,null,null,null,"CARTAGO",{"$error":"#N/A"},7,2007,7654500,1882]
[null,null,null,null,null,null,null,null,null,null,null,null,null,"CHIA",{"$error":"#N/A"},7,2007,330225450,45864]
[null,null,null,null,null,null,null,null,null,null,null,null,null,"CUCUTA","SI",7,2007,221006000,33308]
[null,null,null,null,null,null,null,null,null,null,null,null,null,"DUITAMA",{"$error":"#N/A"},7,2007,6684000,2228]
[null,null,null,null,null,null,null,null,null,null,null,null,null,"ENVIGADO",{"$error":"#N/A"},7,2007,3168000,528]
[null,null,null,null,null,null,null,null,null,null,null,null,null,"FLORENCIA",{"$error":"#N/A"},7,2007,20008000,4304]
[null,null,null,null,null,null,null,null,null,null,null,null,null,"FLORIDABLANCA","SI",7,2007,496086950,74274]
[null,null,null,null,null,null,null,null,null,null,null,null,null,"FUSAGASUGA",{"$error":"#N/A"},7,2007,3966000,887]
[null,null,null,null,null,null,null,null,null,null,null,null,null,"GIRARDOT",{"$f":"+VLOOKUP(N387,$U$2:$V$16,2,FALSE)","v":{"$error":"#N/A"}},7,2007,15303000,3057]
[null,null,null,null,null,null,null,null,null,null,null,null,null,"IBAGUE","SI",7,2007,295729000,44385]
[null,null,null,null,null,null,null,null,null,null,null,null,null,"LORICA",{"$error":"#N/A"},7,2007,768000,192]
[null,null,null,null,null,null,null,null,null,null,null,null,null,"MANIZALES","SI",7,2007,234611850,35220]
[null,null,null,null,null,null,null,null,null,null,null,null,null,"MARINILLA",{"$error":"#N/A"},7,2007,3048000,1016]
[null,null,null,null,null,null,null,null,null,null,null,null,null,"MEDELLIN","SI",7,2007,2597439424,365470]
[null,null,null,null,null,null,null,null,null,null,null,null,null,"MELGAR",{"$error":"#N/A"},7,2007,7887000,1773]
[null,null,null,null,null,null,null,null,null,null,null,null,null,"MONTERIA",{"$error":"#N/A"},7,2007,195224550,24667]
[null,null,null,null,null,null,null,null,null,null,null,null,null,"NEIVA","SI",7,2007,220068250,33650]
[null,null,null,null,null,null,null,null,null,null,null,null,null,"PALMIRA",{"$error":"#N/A"},7,2007,207170100,31351]
[null,null,null,null,null,null,null,null,null,null,null,null,null,"PASTO",{"$error":"#N/A"},7,2007,134137000,26129]
[null,null,null,null,null,null,null,null,null,null,null,null,null,"PEREIRA","SI",7,2007,530942800,75943]
[null,null,null,null,null,null,null,null,null,null,null,null,null,"POPAYAN",{"$error":"#N/A"},7,2007,10696000,2366]
[null,null,null,null,null,null,null,null,null,null,null,null,null,"SAN ANDRES",{"$error":"#N/A"},7,2007,36080000,6193]
[null,null,null,null,null,null,null,null,null,null,null,null,null,"SANTA MARTA","SI",7,2007,251575000,38323]
[null,null,null,null,null,null,null,null,null,null,null,null,null,"SINCELEJO",{"$error":"#N/A"},7,2007,16541000,3636]
[null,null,null,null,null,null,null,null,null,null,null,null,null,"SOGAMOSO",{"$error":"#N/A"},7,2007,24596000,5401]
[null,null,null,null,null,null,null,null,null,null,null,null,null,"TULUA",{"$error":"#N/A"},7,2007,118069000,20464]
[null,null,null,null,null,null,null,null,null,null,null,null,null,"TUNJA",{"$error":"#N/A"},7,2007,22568500,5646]
[null,null,null,null,null,null,null,null,null,null,null,null,null,"VALLEDUPAR","SI",7,2007,5046000,1277]
[null,null,null,null,null,null,null,null,null,null,null,null,null,"VILLAVICENCIO","SI",7,2007,334856500,53174]
[null,null,null,null,null,null,null,null,null,null,null,null,null,"YOPAL",{"$error":"#N/A"},7,2007,9407500,3155]
[null,null,null,null,null,null,null,null,null,null,null,null,null,"ARMENIA",{"$error":"#N/A"},8,2007,160571600,23005]
[null,null,null,null,null,null,null,null,null,null,null,null,null,"BARRANQUILLA","SI",8,2007,586996250,82584]
[null,null,null,null,null,null,null,null,null,null,null,null,null,"BELLO",{"$error":"#N/A"},8,2007,106111500,18213]
[null,null,null,null,null,null,null,null,null,null,null,null,null,"BOGOTA","SI",8,2007,6154410545,803914]
[null,null,null,null,null,null,null,null,null,null,null,null,null,"BUCARAMANGA","SI",8,2007,125549800,20585]
[null,null,null,null,null,null,null,null,null,null,null,null,null,"BUGA",{"$error":"#N/A"},8,2007,12134000,2630]
[null,null,null,null,null,null,null,null,null,null,null,null,null,"CALI","SI",8,2007,1461614600,190179]
[null,null,null,null,null,null,null,null,null,null,null,null,null,"CARTAGENA","SI",8,2007,281526350,47812]
[null,null,null,null,null,null,null,null,null,null,null,null,null,"CARTAGO",{"$error":"#N/A"},8,2007,3484000,956]
[null,null,null,null,null,null,null,null,null,null,null,null,null,"CHIA",{"$error":"#N/A"},8,2007,185406800,25154]
[null,null,null,null,null,null,null,null,null,null,null,null,null,"CUCUTA","SI",8,2007,297117700,41148]
[null,null,null,null,null,null,null,null,null,null,null,null,null,"DUITAMA",{"$error":"#N/A"},8,2007,5057000,1443]
[null,null,null,null,null,null,null,null,null,null,null,null,null,"ENVIGADO",{"$error":"#N/A"},8,2007,6294000,1049]
[null,null,null,null,null,null,null,null,null,null,null,null,null,"FLORENCIA",{"$error":"#N/A"},8,2007,14206000,3956]
[null,null,null,null,null,null,null,null,null,null,null,null,null,"FLORIDABLANCA","SI",8,2007,349441200,51894]
[null,null,null,null,null,null,null,null,null,null,null,null,null,"FUSAGASUGA",{"$error":"#N/A"},8,2007,3822000,813]
[null,null,null,null,null,null,null,null,null,null,null,null,null,"GIRARDOT",{"$error":"#N/A"},8,2007,5729000,1171]
[null,null,null,null,null,null,null,null,null,null,null,null,null,"IBAGUE","SI",8,2007,198408850,29415]
[null,null,null,null,null,null,null,null,null,null,null,null,null,"LORICA",{"$error":"#N/A"},8,2007,452000,113]
[null,null,null,null,null,null,null,null,null,null,null,null,null,"MANIZALES","SI",8,2007,177194450,26304]
[null,null,null,null,null,null,null,null,null,null,null,null,null,"MARINILLA",{"$error":"#N/A"},8,2007,657000,219]
[null,null,null,null,null,null,null,null,null,null,null,null,null,"MEDELLIN","SI",8,2007,1701805261,235563]
[null,null,null,null,null,null,null,null,null,null,null,null,null,"MELGAR",{"$error":"#N/A"},8,2007,4561000,1034]
[null,null,null,null,null,null,null,null,null,null,null,null,null,"MONTERIA",{"$error":"#N/A"},8,2007,112757800,14320]
[null,null,null,null,null,null,null,null,null,null,null,null,null,"NEIVA","SI",8,2007,166625200,25186]
[null,null,null,null,null,null,null,null,null,null,null,null,null,"PALMIRA",{"$error":"#N/A"},8,2007,136463100,20380]
[null,null,null,null,null,null,null,null,null,null,null,null,null,"PASTO",{"$error":"#N/A"},8,2007,73354000,13961]
[null,null,null,null,null,null,null,null,null,null,null,null,null,"PEREIRA","SI",8,2007,329428100,46239]
[null,null,null,null,null,null,null,null,null,null,null,null,null,"POPAYAN",{"$error":"#N/A"},8,2007,6458000,1374]
[null,null,null,null,null,null,null,null,null,null,null,null,null,"SAN ANDRES",{"$error":"#N/A"},8,2007,17326000,2966]
[null,null,null,null,null,null,null,null,null,null,null,null,null,"SANTA MARTA","SI",8,2007,157623300,23703]
[null,null,null,null,null,null,null,null,null,null,null,null,null,"SINCELEJO",{"$error":"#N/A"},8,2007,29659000,5124]
[null,null,null,null,null,null,null,null,null,null,null,null,null,"SOGAMOSO",{"$error":"#N/A"},8,2007,11710000,2442]
[null,null,null,null,null,null,null,null,null,null,null,null,null,"TULUA",{"$error":"#N/A"},8,2007,60241000,10319]
[null,null,null,null,null,null,null,null,null,null,null,null,null,"TUNJA",{"$error":"#N/A"},8,2007,12804000,3201]
[null,null,null,null,null,null,null,null,null,null,null,null,null,"VALLEDUPAR","SI",8,2007,4552000,1171]
[null,null,null,null,null,null,null,null,null,null,null,null,null,"VILLAVICENCIO","SI",8,2007,171457500,26754]
[null,null,null,null,null,null,null,null,null,null,null,null,null,"YOPAL",{"$error":"#N/A"},8,2007,2767000,921]
[null,null,null,null,null,null,null,null,null,null,null,null,null,"ARMENIA",{"$error":"#N/A"},9,2007,71262250,10491]
[null,null,null,null,null,null,null,null,null,null,null,null,null,"BARRANQUILLA","SI",9,2007,323468950,45559]
[null,null,null,null,null,null,null,null,null,null,null,null,null,"BELLO",{"$error":"#N/A"},9,2007,42214600,7348]
[null,null,null,null,null,null,null,null,null,null,null,null,null,"BOGOTA","SI",9,2007,3331041391,440900]
[null,null,null,null,null,null,null,null,null,null,null,null,null,"BUCARAMANGA",{"$f":"+VLOOKUP(N451,$U$2:$V$16,2,FALSE)","v":"SI"},9,2007,47604050,8275]
[null,null,null,null,null,null,null,null,null,null,null,null,null,"BUGA",{"$error":"#N/A"},9,2007,3683000,902]
[null,null,null,null,null,null,null,null,null,null,null,null,null,"CALI","SI",9,2007,629133500,83640]
[null,null,null,null,null,null,null,null,null,null,null,null,null,"CARTAGENA","SI",9,2007,143033700,23914]
[null,null,null,null,null,null,null,null,null,null,null,null,null,"CARTAGO",{"$error":"#N/A"},9,2007,1345000,378]
[null,null,null,null,null,null,null,null,null,null,null,null,null,"CHIA",{"$error":"#N/A"},9,2007,101989750,13943]
[null,null,null,null,null,null,null,null,null,null,null,null,null,"CUCUTA","SI",9,2007,176174600,25325]
[null,null,null,null,null,null,null,null,null,null,null,null,null,"DUITAMA",{"$error":"#N/A"},9,2007,1435000,410]
[null,null,null,null,null,null,null,null,null,null,null,null,null,"ENVIGADO",{"$error":"#N/A"},9,2007,432000,72]
[null,null,null,null,null,null,null,null,null,null,null,null,null,"FLORENCIA",{"$error":"#N/A"},9,2007,6148000,1278]
[null,null,null,null,null,null,null,null,null,null,null,null,null,"FLORIDABLANCA","SI",9,2007,169500150,25255]
[null,null,null,null,null,null,null,null,null,null,null,null,null,"FUSAGASUGA",{"$error":"#N/A"},9,2007,1652000,351]
[null,null,null,null,null,null,null,null,null,null,null,null,null,"GIRARDOT",{"$error":"#N/A"},9,2007,1989000,354]
[null,null,null,null,null,null,null,null,null,null,null,null,null,"IBAGUE","SI",9,2007,91404350,13780]
[null,null,null,null,null,null,null,null,null,null,null,null,null,"LORICA",{"$error":"#N/A"},9,2007,260000,65]
[null,null,null,null,null,null,null,null,null,null,null,null,null,"MANIZALES","SI",9,2007,64828900,9695]
[null,null,null,null,null,null,null,null,null,null,null,null,null,"MARINILLA",{"$error":"#N/A"},9,2007,615000,205]
[null,null,null,null,null,null,null,null,null,null,null,null,null,"MEDELLIN","SI",9,2007,917747902,127618]
[null,null,null,null,null,null,null,null,null,null,null,null,null,"MELGAR",{"$error":"#N/A"},9,2007,1558000,388]
[null,null,null,null,null,null,null,null,null,null,null,null,null,"MONTERIA",{"$error":"#N/A"},9,2007,60406500,7547]
[null,null,null,null,null,null,null,null,null,null,null,null,null,"NEIVA","SI",9,2007,72374250,11042]
[null,null,null,null,null,null,null,null,null,null,null,null,null,"PALMIRA",{"$error":"#N/A"},9,2007,49529400,7395]
[null,null,null,null,null,null,null,null,null,null,null,null,null,"PASTO",{"$error":"#N/A"},9,2007,26622000,5066]
[null,null,null,null,null,null,null,null,null,null,null,null,null,"PEREIRA","SI",9,2007,173051150,24497]
[null,null,null,null,null,null,null,null,null,null,null,null,null,"POPAYAN",{"$error":"#N/A"},9,2007,2386000,587]
[null,null,null,null,null,null,null,null,null,null,null,null,null,"SAN ANDRES",{"$error":"#N/A"},9,2007,7183000,1161]
[null,null,null,null,null,null,null,null,null,null,null,null,null,"SANTA MARTA","SI",9,2007,74529000,11406]
[null,null,null,null,null,null,null,null,null,null,null,null,null,"SINCELEJO",{"$error":"#N/A"},9,2007,32928000,5667]
[null,null,null,null,null,null,null,null,null,null,null,null,null,"SOGAMOSO",{"$error":"#N/A"},9,2007,1996000,433]
[null,null,null,null,null,null,null,null,null,null,null,null,null,"TULUA",{"$error":"#N/A"},9,2007,28758000,4984]
[null,null,null,null,null,null,null,null,null,null,null,null,null,"TUNJA",{"$error":"#N/A"},9,2007,3152000,788]
[null,null,null,null,null,null,null,null,null,null,null,null,null,"VALLEDUPAR","SI",9,2007,2437000,650]
[null,null,null,null,null,null,null,null,null,null,null,null,null,"VILLAVICENCIO","SI",9,2007,81851250,14018]
[null,null,null,null,null,null,null,null,null,null,null,null,null,"YOPAL",{"$error":"#N/A"},9,2007,1645500,557]
[null,null,null,null,null,null,null,null,null,null,null,null,null,"ARMENIA",{"$error":"#N/A"},10,2007,70910150,12630]
[null,null,null,null,null,null,null,null,null,null,null,null,null,"BARRANQUILLA","SI",10,2007,352247450,59826]
[null,null,null,null,null,null,null,null,null,null,null,null,null,"BELLO",{"$error":"#N/A"},10,2007,52967600,10716]
[null,null,null,null,null,null,null,null,null,null,null,null,null,"BOGOTA","SI",10,2007,3228750712,526293]
[null,null,null,null,null,null,null,null,null,null,null,null,null,"BUCARAMANGA","SI",10,2007,56020450,11770]
[null,null,null,null,null,null,null,null,null,null,null,null,null,"BUGA",{"$error":"#N/A"},10,2007,3609000,806]
[null,null,null,null,null,null,null,null,null,null,null,null,null,"CALI","SI",10,2007,710791050,118201]
[null,null,null,null,null,null,null,null,null,null,null,null,null,"CARTAGENA","SI",10,2007,122448100,26836]
[null,null,null,null,null,null,null,null,null,null,null,null,null,"CARTAGO",{"$error":"#N/A"},10,2007,1583000,431]
[null,null,null,null,null,null,null,null,null,null,null,null,null,"CHIA",{"$error":"#N/A"},10,2007,106204850,18087]
[null,null,null,null,null,null,null,null,null,null,null,null,null,"CUCUTA","SI",10,2007,155775600,26167]
[null,null,null,null,null,null,null,null,null,null,null,null,null,"DUITAMA",{"$error":"#N/A"},10,2007,1519000,435]
[null,null,null,null,null,null,null,null,null,null,null,null,null,"ENVIGADO",{"$error":"#N/A"},10,2007,426000,77]
[null,null,null,null,null,null,null,null,null,null,null,null,null,"FLORENCIA",{"$error":"#N/A"},10,2007,3543000,702]
[null,null,null,null,null,null,null,null,null,null,null,null,null,"FLORIDABLANCA","SI",10,2007,180568950,31895]
[null,null,null,null,null,null,null,null,null,null,null,null,null,"FUSAGASUGA",{"$error":"#N/A"},10,2007,386000,86]
[null,null,null,null,null,null,null,null,null,null,null,null,null,"GIRARDOT",{"$error":"#N/A"},10,2007,506000,103]
[null,null,null,null,null,null,null,null,null,null,null,null,null,"IBAGUE","SI",10,2007,97935250,17253]
[null,null,null,null,null,null,null,null,null,null,null,null,null,"MANIZALES","SI",10,2007,68110550,12185]
[null,null,null,null,null,null,null,null,null,null,null,null,null,"MEDELLIN","SI",10,2007,989705650,164334]
[null,null,null,null,null,null,null,null,null,null,null,null,null,"MELGAR",{"$error":"#N/A"},10,2007,2119000,501]
[null,null,null,null,null,null,null,null,null,null,null,null,null,"MONTERIA",{"$error":"#N/A"},10,2007,56421600,8901]
[null,null,null,null,null,null,null,null,null,null,null,null,null,"NEIVA","SI",10,2007,75194750,13321]
[null,null,null,null,null,null,null,null,null,null,null,null,null,"PALMIRA",{"$error":"#N/A"},10,2007,63143650,10933]
[null,null,null,null,null,null,null,null,null,null,null,null,null,"PASTO",{"$error":"#N/A"},10,2007,22368500,4927]
[null,null,null,null,null,null,null,null,null,null,null,null,null,"PEREIRA","SI",10,2007,147476650,25421]
[null,null,null,null,null,null,null,null,null,null,null,null,null,"POPAYAN",{"$error":"#N/A"},10,2007,2446000,581]
[null,null,null,null,null,null,null,null,null,null,null,null,null,"SAN ANDRES",{"$error":"#N/A"},10,2007,4869000,1047]
[null,null,null,null,null,null,null,null,null,null,null,null,null,"SANTA MARTA","SI",10,2007,76046900,13661]
[null,null,null,null,null,null,null,null,null,null,null,null,null,"SINCELEJO",{"$error":"#N/A"},10,2007,29977500,6203]
[null,null,null,null,null,null,null,null,null,null,null,null,null,"SOGAMOSO",{"$f":"+VLOOKUP(N515,$U$2:$V$16,2,FALSE)","v":{"$error":"#N/A"}},10,2007,1838000,414]
[null,null,null,null,null,null,null,null,null,null,null,null,null,"TULUA",{"$error":"#N/A"},10,2007,24799500,4939]
[null,null,null,null,null,null,null,null,null,null,null,null,null,"TUNJA",{"$error":"#N/A"},10,2007,3740000,935]
[null,null,null,null,null,null,null,null,null,null,null,null,null,"VALLEDUPAR","SI",10,2007,1003000,317]
[null,null,null,null,null,null,null,null,null,null,null,null,null,"VILLAVICENCIO","SI",10,2007,75790100,15535]
[null,null,null,null,null,null,null,null,null,null,null,null,null,"YOPAL",{"$error":"#N/A"},10,2007,1340500,459]
[null,null,null,null,null,null,null,null,null,null,null,null,null,"ARMENIA",{"$error":"#N/A"},11,2007,89131550,12775]
[null,null,null,null,null,null,null,null,null,null,null,null,null,"BARRANQUILLA","SI",11,2007,411220550,57257]
[null,null,null,null,null,null,null,null,null,null,null,null,null,"BELLO",{"$error":"#N/A"},11,2007,64193000,10467]
[null,null,null,null,null,null,null,null,null,null,null,null,null,"BOGOTA","SI",11,2007,4060884296,521359]
[null,null,null,null,null,null,null,null,null,null,null,null,null,"BUCARAMANGA","SI",11,2007,74520900,12343]
[null,null,null,null,null,null,null,null,null,null,null,null,null,"BUGA",{"$error":"#N/A"},11,2007,6808000,1461]
[null,null,null,null,null,null,null,null,null,null,null,null,null,"CALI","SI",11,2007,802721300,106260]
[null,null,null,null,null,null,null,null,null,null,null,null,null,"CARTAGENA","SI",11,2007,163246150,27417]
[null,null,null,null,null,null,null,null,null,null,null,null,null,"CARTAGO",{"$error":"#N/A"},11,2007,1304000,374]
[null,null,null,null,null,null,null,null,null,null,null,null,null,"CHIA",{"$error":"#N/A"},11,2007,122083750,16881]
[null,null,null,null,null,null,null,null,null,null,null,null,null,"CUCUTA","SI",11,2007,203425650,28243]
[null,null,null,null,null,null,null,null,null,null,null,null,null,"DUITAMA",{"$error":"#N/A"},11,2007,1802500,515]
[null,null,null,null,null,null,null,null,null,null,null,null,null,"ENVIGADO",{"$error":"#N/A"},11,2007,1548000,258]
[null,null,null,null,null,null,null,null,null,null,null,null,null,"FLORENCIA",{"$error":"#N/A"},11,2007,5907000,1224]
[null,null,null,null,null,null,null,null,null,null,null,null,null,"FLORIDABLANCA","SI",11,2007,254705950,33744]
[null,null,null,null,null,null,null,null,null,null,null,null,null,"FUSAGASUGA",{"$error":"#N/A"},11,2007,667000,149]
[null,null,null,null,null,null,null,null,null,null,null,null,null,"GIRARDOT",{"$error":"#N/A"},11,2007,1255000,264]
[null,null,null,null,null,null,null,null,null,null,null,null,null,"IBAGUE","SI",11,2007,128941950,18087]
[null,null,null,null,null,null,null,null,null,null,null,null,null,"MANIZALES","SI",11,2007,95252250,13169]
[null,null,null,null,null,null,null,null,null,null,null,null,null,"MEDELLIN","SI",11,2007,1150511300,152206]
[null,null,null,null,null,null,null,null,null,null,null,null,null,"MELGAR",{"$error":"#N/A"},11,2007,1811000,396]
[null,null,null,null,null,null,null,null,null,null,null,null,null,"MONTERIA",{"$error":"#N/A"},11,2007,77606000,9822]
[null,null,null,null,null,null,null,null,null,null,null,null,null,"NEIVA","SI",11,2007,125218050,17318]
[null,null,null,null,null,null,null,null,null,null,null,null,null,"PALMIRA",{"$error":"#N/A"},11,2007,78999700,10986]
[null,null,null,null,null,null,null,null,null,null,null,null,null,"PASTO",{"$error":"#N/A"},11,2007,31775000,5758]
[null,null,null,null,null,null,null,null,null,null,null,null,null,"PEREIRA","SI",11,2007,205241650,28825]
[null,null,null,null,null,null,null,null,null,null,null,null,null,"POPAYAN",{"$error":"#N/A"},11,2007,2894000,672]
[null,null,null,null,null,null,null,null,null,null,null,null,null,"SAN ANDRES",{"$error":"#N/A"},11,2007,9555000,1905]
[null,null,null,null,null,null,null,null,null,null,null,null,null,"SANTA MARTA","SI",11,2007,113036600,16414]
[null,null,null,null,null,null,null,null,null,null,null,null,null,"SINCELEJO",{"$error":"#N/A"},11,2007,39210000,6447]
[null,null,null,null,null,null,null,null,null,null,null,null,null,"SOGAMOSO",{"$error":"#N/A"},11,2007,3415000,732]
[null,null,null,null,null,null,null,null,null,null,null,null,null,"TULUA",{"$error":"#N/A"},11,2007,32935000,5539]
[null,null,null,null,null,null,null,null,null,null,null,null,null,"TUNJA",{"$error":"#N/A"},11,2007,4628000,1157]
[null,null,null,null,null,null,null,null,null,null,null,null,null,"VALLEDUPAR","SI",11,2007,2104000,533]
[null,null,null,null,null,null,null,null,null,null,null,null,null,"VILLAVICENCIO","SI",11,2007,121985000,21614]
[null,null,null,null,null,null,null,null,null,null,null,null,null,"YOPAL",{"$error":"#N/A"},11,2007,1042000,358]
[null,null,null,null,null,null,null,null,null,null,null,null,null,"ARMENIA",{"$error":"#N/A"},12,2007,174653300,24858]
[null,null,null,null,null,null,null,null,null,null,null,null,null,"BARRANQUILLA","SI",12,2007,623023450,88793]
[null,null,null,null,null,null,null,null,null,null,null,null,null,"BELLO",{"$error":"#N/A"},12,2007,104754100,17422]
[null,null,null,null,null,null,null,null,null,null,null,null,null,"BOGOTA","SI",12,2007,6007445495,782073]
[null,null,null,null,null,null,null,null,null,null,null,null,null,"BUCARAMANGA","SI",12,2007,142172300,22354]
[null,null,null,null,null,null,null,null,null,null,null,null,null,"BUGA",{"$error":"#N/A"},12,2007,6588000,1525]
[null,null,null,null,null,null,null,null,null,null,null,null,null,"CALI","SI",12,2007,1320001150,169042]
[null,null,null,null,null,null,null,null,null,null,null,null,null,"CARTAGENA","SI",12,2007,314387250,52437]
[null,null,null,null,null,null,null,null,null,null,null,null,null,"CARTAGO",{"$error":"#N/A"},12,2007,51488500,9620]
[null,null,null,null,null,null,null,null,null,null,null,null,null,"CHIA",{"$error":"#N/A"},12,2007,223596900,30625]
[null,null,null,null,null,null,null,null,null,null,null,null,null,"CUCUTA","SI",12,2007,324588950,44895]
[null,null,null,null,null,null,null,null,null,null,null,null,null,"DUITAMA",{"$error":"#N/A"},12,2007,5901000,1686]
[null,null,null,null,null,null,null,null,null,null,null,null,null,"ENVIGADO",{"$error":"#N/A"},12,2007,654000,109]
[null,null,null,null,null,null,null,null,null,null,null,null,null,"FLORENCIA",{"$error":"#N/A"},12,2007,19284000,3893]
[null,null,null,null,null,null,null,null,null,null,null,null,null,"FLORIDABLANCA","SI",12,2007,410977050,55170]
[null,null,null,null,null,null,null,null,null,null,null,null,null,"FUSAGASUGA",{"$error":"#N/A"},12,2007,627000,142]
[null,null,null,null,null,null,null,null,null,null,null,null,null,"GIRARDOT",{"$error":"#N/A"},12,2007,6401000,1437]
[null,null,null,null,null,null,null,null,null,null,null,null,null,"IBAGUE","SI",12,2007,253798600,34836]
[null,null,null,null,null,null,null,null,null,null,null,null,null,"MANIZALES","SI",12,2007,176315150,24235]
[null,null,null,null,null,null,null,null,null,null,null,null,null,"MEDELLIN","SI",12,2007,1606767458,219018]
[null,null,null,null,null,null,null,null,null,null,null,null,null,"MELGAR",{"$error":"#N/A"},12,2007,3728000,845]
[null,null,null,null,null,null,null,null,null,null,null,null,null,"MONTERIA",{"$error":"#N/A"},12,2007,134483900,17138]
[null,null,null,null,null,null,null,null,null,null,null,null,null,"NEIVA",{"$f":"+VLOOKUP(N579,$U$2:$V$16,2,FALSE)","v":"SI"},12,2007,219585750,29904]
[null,null,null,null,null,null,null,null,null,null,null,null,null,"PALMIRA",{"$error":"#N/A"},12,2007,130704050,17569]
[null,null,null,null,null,null,null,null,null,null,null,null,null,"PASTO",{"$error":"#N/A"},12,2007,60166000,11282]
[null,null,null,null,null,null,null,null,null,null,null,null,null,"PEREIRA","SI",12,2007,338333050,47895]
[null,null,null,null,null,null,null,null,null,null,null,null,null,"POPAYAN",{"$error":"#N/A"},12,2007,6599000,1557]
[null,null,null,null,null,null,null,null,null,null,null,null,null,"SAN ANDRES",{"$error":"#N/A"},12,2007,24335000,4031]
[null,null,null,null,null,null,null,null,null,null,null,null,null,"SANTA MARTA","SI",12,2007,183615600,26530]
[null,null,null,null,null,null,null,null,null,null,null,null,null,"SINCELEJO",{"$error":"#N/A"},12,2007,68200000,11443]
[null,null,null,null,null,null,null,null,null,null,null,null,null,"SOGAMOSO",{"$error":"#N/A"},12,2007,6483000,1450]
[null,null,null,null,null,null,null,null,null,null,null,null,null,"TULUA",{"$error":"#N/A"},12,2007,58812000,10374]
[null,null,null,null,null,null,null,null,null,null,null,null,null,"TUNJA",{"$error":"#N/A"},12,2007,10604000,2651]
[null,null,null,null,null,null,null,null,null,null,null,null,null,"VALLEDUPAR","SI",12,2007,5374000,1392]
[null,null,null,null,null,null,null,null,null,null,null,null,null,"VILLAVICENCIO","SI",12,2007,225148000,37085]
[null,null,null,null,null,null,null,null,null,null,null,null,null,"YOPAL",{"$error":"#N/A"},12,2007,1620500,571]
[null,null,null,null,null,null,null,null,null,null,null,null,null,"ARMENIA",{"$error":"#N/A"},1,2008,245121450,33927]
[null,null,null,null,null,null,null,null,null,null,null,null,null,"BARRANQUILLA","SI",1,2008,661327000,97818]
[null,null,null,null,null,null,null,null,null,null,null,null,null,"BELLO",{"$error":"#N/A"},1,2008,160619000,26098]
[null,null,null,null,null,null,null,null,null,null,null,null,null,"BOGOTA","SI",1,2008,8610439175,1092588]
[null,null,null,null,null,null,null,null,null,null,null,null,null,"BUCARAMANGA","SI",1,2008,256325700,38133]
[null,null,null,null,null,null,null,null,null,null,null,null,null,"BUGA",{"$error":"#N/A"},1,2008,11231000,2432]
[null,null,null,null,null,null,null,null,null,null,null,null,null,"CALI","SI",1,2008,2140705250,259450]
[null,null,null,null,null,null,null,null,null,null,null,null,null,"CARTAGENA","SI",1,2008,341516400,57377]
[null,null,null,null,null,null,null,null,null,null,null,null,null,"CARTAGO",{"$error":"#N/A"},1,2008,79180000,13134]
[null,null,null,null,null,null,null,null,null,null,null,null,null,"CHIA",{"$error":"#N/A"},1,2008,306028000,39860]
[null,null,null,null,null,null,null,null,null,null,null,null,null,"CUCUTA","SI",1,2008,496633600,68297]
[null,null,null,null,null,null,null,null,null,null,null,null,null,"DUITAMA",{"$error":"#N/A"},1,2008,7262500,2075]
[null,null,null,null,null,null,null,null,null,null,null,null,null,"ENVIGADO",{"$error":"#N/A"},1,2008,6048000,1008]
[null,null,null,null,null,null,null,null,null,null,null,null,null,"FLORENCIA",{"$error":"#N/A"},1,2008,17475500,3750]
[null,null,null,null,null,null,null,null,null,null,null,null,null,"FLORIDABLANCA","SI",1,2008,531031250,71731]
[null,null,null,null,null,null,null,null,null,null,null,null,null,"FUSAGASUGA",{"$error":"#N/A"},1,2008,3688000,808]
[null,null,null,null,null,null,null,null,null,null,null,null,null,"GIRARDOT",{"$error":"#N/A"},1,2008,14347000,3182]
[null,null,null,null,null,null,null,null,null,null,null,null,null,"IBAGUE","SI",1,2008,335763000,45318]
[null,null,null,null,null,null,null,null,null,null,null,null,null,"MANIZALES","SI",1,2008,222730000,30006]
[null,null,null,null,null,null,null,null,null,null,null,null,null,"MEDELLIN","SI",1,2008,2453181792,338845]
[null,null,null,null,null,null,null,null,null,null,null,null,null,"MELGAR",{"$error":"#N/A"},1,2008,7277000,1669]
[null,null,null,null,null,null,null,null,null,null,null,null,null,"MONTERIA",{"$error":"#N/A"},1,2008,150570400,19556]
[null,null,null,null,null,null,null,null,null,null,null,null,null,"NEIVA","SI",1,2008,247544500,33375]
[null,null,null,null,null,null,null,null,null,null,null,null,null,"PALMIRA",{"$error":"#N/A"},1,2008,200074000,26431]
[null,null,null,null,null,null,null,null,null,null,null,null,null,"PASTO",{"$error":"#N/A"},1,2008,63475600,12096]
[null,null,null,null,null,null,null,null,null,null,null,null,null,"PEREIRA","SI",1,2008,503171750,69617]
[null,null,null,null,null,null,null,null,null,null,null,null,null,"POPAYAN",{"$error":"#N/A"},1,2008,5680000,1282]
[null,null,null,null,null,null,null,null,null,null,null,null,null,"SAN ANDRES",{"$error":"#N/A"},1,2008,22695000,3881]
[null,null,null,null,null,null,null,null,null,null,null,null,null,"SANTA MARTA","SI",1,2008,231714300,33273]
[null,null,null,null,null,null,null,null,null,null,null,null,null,"SINCELEJO",{"$error":"#N/A"},1,2008,60766600,10397]
[null,null,null,null,null,null,null,null,null,null,null,null,null,"SOGAMOSO",{"$error":"#N/A"},1,2008,9729000,2131]
[null,null,null,null,null,null,null,null,null,null,null,null,null,"TULUA",{"$error":"#N/A"},1,2008,71832200,12801]
[null,null,null,null,null,null,null,null,null,null,null,null,null,"TUNJA",{"$error":"#N/A"},1,2008,12200000,3050]
[null,null,null,null,null,null,null,null,null,null,null,null,null,"VALLEDUPAR","SI",1,2008,4648000,1271]
[null,null,null,null,null,null,null,null,null,null,null,null,null,"VILLAVICENCIO","SI",1,2008,285798006,43654]
[null,null,null,null,null,null,null,null,null,null,null,null,null,"YOPAL",{"$error":"#N/A"},1,2008,7125000,2125]
[null,null,null,null,null,null,null,null,null,null,null,null,null,"ARMENIA",{"$error":"#N/A"},2,2008,124113300,16927]
[null,null,null,null,null,null,null,null,null,null,null,null,null,"BARRANQUILLA","SI",2,2008,450988250,67315]
[null,null,null,null,null,null,null,null,null,null,null,null,null,"BELLO",{"$error":"#N/A"},2,2008,87401110,13553]
[null,null,null,null,null,null,null,null,null,null,null,null,null,"BOGOTA","SI",2,2008,5061443942,627538]
[null,null,null,null,null,null,null,null,null,null,null,null,null,"BUCARAMANGA","SI",2,2008,113538650,16814]
[null,null,null,null,null,null,null,null,null,null,null,null,null,"BUGA",{"$error":"#N/A"},2,2008,8494000,1828]
[null,null,null,null,null,null,null,null,null,null,null,null,null,"CALI","SI",2,2008,1319953150,160289]
[null,null,null,null,null,null,null,null,null,null,null,null,null,"CARTAGENA","SI",2,2008,172933300,28618]
[null,null,null,null,null,null,null,null,null,null,null,null,null,"CARTAGO",{"$error":"#N/A"},2,2008,49443000,8312]
[null,null,null,null,null,null,null,null,null,null,null,null,null,"CHIA",{"$error":"#N/A"},2,2008,153886050,19431]
[null,null,null,null,null,null,null,null,null,null,null,null,null,"CUCUTA","SI",2,2008,242574000,37979]
[null,null,null,null,null,null,null,null,null,null,null,null,null,"DUITAMA",{"$error":"#N/A"},2,2008,2656500,759]
[null,null,null,null,null,null,null,null,null,null,null,null,null,"ENVIGADO",{"$error":"#N/A"},2,2008,2013000,343]
[null,null,null,null,null,null,null,null,null,null,null,null,null,"FLORENCIA",{"$error":"#N/A"},2,2008,11054000,2440]
[null,null,null,null,null,null,null,null,null,null,null,null,null,"FLORIDABLANCA",{"$f":"+VLOOKUP(N643,$U$2:$V$16,2,FALSE)","v":"SI"},2,2008,222485000,30621]
[null,null,null,null,null,null,null,null,null,null,null,null,null,"FUSAGASUGA",{"$error":"#N/A"},2,2008,1748000,390]
[null,null,null,null,null,null,null,null,null,null,null,null,null,"GIRARDOT",{"$error":"#N/A"},2,2008,3597000,751]
[null,null,null,null,null,null,null,null,null,null,null,null,null,"IBAGUE","SI",2,2008,128847500,17860]
[null,null,null,null,null,null,null,null,null,null,null,null,null,"MANIZALES","SI",2,2008,122969000,16667]
[null,null,null,null,null,null,null,null,null,null,null,null,null,"MEDELLIN","SI",2,2008,1575336463,217419]
[null,null,null,null,null,null,null,null,null,null,null,null,null,"MELGAR",{"$error":"#N/A"},2,2008,1643500,387]
[null,null,null,null,null,null,null,null,null,null,null,null,null,"MONTERIA",{"$error":"#N/A"},2,2008,66339250,8316]
[null,null,null,null,null,null,null,null,null,null,null,null,null,"NEIVA","SI",2,2008,117255500,16210]
[null,null,null,null,null,null,null,null,null,null,null,null,null,"PALMIRA",{"$error":"#N/A"},2,2008,90833500,12415]
[null,null,null,null,null,null,null,null,null,null,null,null,null,"PASTO",{"$error":"#N/A"},2,2008,36478600,6812]
[null,null,null,null,null,null,null,null,null,null,null,null,null,"PEREIRA","SI",2,2008,275599650,37695]
[null,null,null,null,null,null,null,null,null,null,null,null,null,"POPAYAN",{"$error":"#N/A"},2,2008,3118000,688]
[null,null,null,null,null,null,null,null,null,null,null,null,null,"SAN ANDRES",{"$error":"#N/A"},2,2008,10929000,1865]
[null,null,null,null,null,null,null,null,null,null,null,null,null,"SANTA MARTA","SI",2,2008,106575400,15858]
[null,null,null,null,null,null,null,null,null,null,null,null,null,"SINCELEJO",{"$error":"#N/A"},2,2008,33180000,5458]
[null,null,null,null,null,null,null,null,null,null,null,null,null,"SOGAMOSO",{"$error":"#N/A"},2,2008,2889000,629]
[null,null,null,null,null,null,null,null,null,null,null,null,null,"TULUA",{"$error":"#N/A"},2,2008,43588000,8423]
[null,null,null,null,null,null,null,null,null,null,null,null,null,"TUNJA",{"$error":"#N/A"},2,2008,5560000,1390]
[null,null,null,null,null,null,null,null,null,null,null,null,null,"VALLEDUPAR","SI",2,2008,2174000,616]
[null,null,null,null,null,null,null,null,null,null,null,null,null,"VILLAVICENCIO","SI",2,2008,153596046,24135]
[null,null,null,null,null,null,null,null,null,null,null,null,null,"YOPAL",{"$error":"#N/A"},2,2008,2728000,807]
[null,null,null,null,null,null,null,null,null,null,null,null,null,"ARMENIA",{"$error":"#N/A"},3,2008,152256450,20649]
[null,null,null,null,null,null,null,null,null,null,null,null,null,"BARRANQUILLA","SI",3,2008,575310300,85740]
[null,null,null,null,null,null,null,null,null,null,null,null,null,"BELLO",{"$error":"#N/A"},3,2008,110751000,17610]
[null,null,null,null,null,null,null,null,null,null,null,null,null,"BOGOTA","SI",3,2008,6282094740,789083]
[null,null,null,null,null,null,null,null,null,null,null,null,null,"BUCARAMANGA","SI",3,2008,157326050,23151]
[null,null,null,null,null,null,null,null,null,null,null,null,null,"BUGA",{"$error":"#N/A"},3,2008,13377000,2913]
[null,null,null,null,null,null,null,null,null,null,null,null,null,"CALI","SI",3,2008,1526327800,187024]
[null,null,null,null,null,null,null,null,null,null,null,null,null,"CARTAGENA","SI",3,2008,244965400,39267]
[null,null,null,null,null,null,null,null,null,null,null,null,null,"CARTAGO",{"$error":"#N/A"},3,2008,59737000,9891]
[null,null,null,null,null,null,null,null,null,null,null,null,null,"CHIA",{"$error":"#N/A"},3,2008,221888450,28540]
[null,null,null,null,null,null,null,null,null,null,null,null,null,"CUCUTA","SI",3,2008,303518200,40764]
[null,null,null,null,null,null,null,null,null,null,null,null,null,"DUITAMA",{"$error":"#N/A"},3,2008,5677000,1435]
[null,null,null,null,null,null,null,null,null,null,null,null,null,"ENVIGADO",{"$error":"#N/A"},3,2008,4344000,724]
[null,null,null,null,null,null,null,null,null,null,null,null,null,"FLORENCIA",{"$error":"#N/A"},3,2008,15831500,3339]
[null,null,null,null,null,null,null,null,null,null,null,null,null,"FLORIDABLANCA","SI",3,2008,317476750,41919]
[null,null,null,null,null,null,null,null,null,null,null,null,null,"FUSAGASUGA",{"$error":"#N/A"},3,2008,870000,186]
[null,null,null,null,null,null,null,null,null,null,null,null,null,"GIRARDOT",{"$error":"#N/A"},3,2008,8199000,1756]
[null,null,null,null,null,null,null,null,null,null,null,null,null,"IBAGUE","SI",3,2008,214139500,28454]
[null,null,null,null,null,null,null,null,null,null,null,null,null,"MANIZALES","SI",3,2008,161220000,21254]
[null,null,null,null,null,null,null,null,null,null,null,null,null,"MEDELLIN","SI",3,2008,1826975506,246977]
[null,null,null,null,null,null,null,null,null,null,null,null,null,"MELGAR",{"$error":"#N/A"},3,2008,5362000,1175]
[null,null,null,null,null,null,null,null,null,null,null,null,null,"MONTERIA",{"$error":"#N/A"},3,2008,74280000,9371]
[null,null,null,null,null,null,null,null,null,null,null,null,null,"NEIVA","SI",3,2008,166354000,22192]
[null,null,null,null,null,null,null,null,null,null,null,null,null,"PALMIRA",{"$error":"#N/A"},3,2008,133614000,17536]
[null,null,null,null,null,null,null,null,null,null,null,null,null,"PASTO",{"$error":"#N/A"},3,2008,39842800,6621]
[null,null,null,null,null,null,null,null,null,null,null,null,null,"PEREIRA","SI",3,2008,321779600,44179]
[null,null,null,null,null,null,null,null,null,null,null,null,null,"POPAYAN",{"$error":"#N/A"},3,2008,3594000,818]
[null,null,null,null,null,null,null,null,null,null,null,null,null,"SAN ANDRES",{"$error":"#N/A"},3,2008,17645000,3099]
[null,null,null,null,null,null,null,null,null,null,null,null,null,"SANTA MARTA","SI",3,2008,134873300,21637]
[null,null,null,null,null,null,null,null,null,null,null,null,null,"SINCELEJO",{"$error":"#N/A"},3,2008,52256100,8187]
[null,null,null,null,null,null,null,null,null,null,null,null,null,"SOGAMOSO",{"$error":"#N/A"},3,2008,3202000,663]
[null,null,null,null,null,null,null,null,null,null,null,null,null,"TULUA",{"$error":"#N/A"},3,2008,57331900,9121]
[null,null,null,null,null,null,null,null,null,null,null,null,null,"TUNJA",{"$error":"#N/A"},3,2008,4496000,1124]
[null,null,null,null,null,null,null,null,null,null,null,null,null,"VALLEDUPAR","SI",3,2008,4396000,1099]
[null,null,null,null,null,null,null,null,null,null,null,null,null,"VILLAVICENCIO","SI",3,2008,221569057,35500]
[null,null,null,null,null,null,null,null,null,null,null,null,null,"YOPAL",{"$error":"#N/A"},3,2008,3451500,1013]
[null,null,null,null,null,null,null,null,null,null,null,null,null,"ARMENIA",{"$error":"#N/A"},4,2008,87472600,12672]
[null,null,null,null,null,null,null,null,null,null,null,null,null,"BARRANQUILLA","SI",4,2008,389180950,59705]
[null,null,null,null,null,null,null,null,null,null,null,null,null,"BELLO",{"$error":"#N/A"},4,2008,62985550,10031]
[null,null,null,null,null,null,null,null,null,null,null,null,null,"BOGOTA","SI",4,2008,4144137856,543514]
[null,null,null,null,null,null,null,null,null,null,null,null,null,"BUCARAMANGA","SI",4,2008,101996950,15525]
[null,null,null,null,null,null,null,null,null,null,null,null,null,"BUGA",{"$error":"#N/A"},4,2008,4055000,938]
[null,null,null,null,null,null,null,null,null,null,null,null,null,"CALI",{"$f":"+VLOOKUP(N707,$U$2:$V$16,2,FALSE)","v":"SI"},4,2008,1088832000,137553]
[null,null,null,null,null,null,null,null,null,null,null,null,null,"CARTAGENA","SI",4,2008,167358650,30165]
[null,null,null,null,null,null,null,null,null,null,null,null,null,"CARTAGO",{"$error":"#N/A"},4,2008,31228750,5621]
[null,null,null,null,null,null,null,null,null,null,null,null,null,"CHIA",{"$error":"#N/A"},4,2008,128219400,17984]
[null,null,null,null,null,null,null,null,null,null,null,null,null,"CUCUTA","SI",4,2008,194803650,26480]
[null,null,null,null,null,null,null,null,null,null,null,null,null,"DUITAMA",{"$error":"#N/A"},4,2008,2792000,698]
[null,null,null,null,null,null,null,null,null,null,null,null,null,"ENVIGADO",{"$error":"#N/A"},4,2008,1806000,301]
[null,null,null,null,null,null,null,null,null,null,null,null,null,"FLORENCIA",{"$error":"#N/A"},4,2008,6107500,1242]
[null,null,null,null,null,null,null,null,null,null,null,null,null,"FLORIDABLANCA","SI",4,2008,181161750,24749]
[null,null,null,null,null,null,null,null,null,null,null,null,null,"FUSAGASUGA",{"$error":"#N/A"},4,2008,1237000,266]
[null,null,null,null,null,null,null,null,null,null,null,null,null,"GIRARDOT",{"$error":"#N/A"},4,2008,4079000,855]
[null,null,null,null,null,null,null,null,null,null,null,null,null,"IBAGUE","SI",4,2008,107473000,14616]
[null,null,null,null,null,null,null,null,null,null,null,null,null,"MANIZALES","SI",4,2008,81590500,11026]
[null,null,null,null,null,null,null,null,null,null,null,null,null,"MEDELLIN","SI",4,2008,1156397502,158908]
[null,null,null,null,null,null,null,null,null,null,null,null,null,"MELGAR",{"$error":"#N/A"},4,2008,1199000,277]
[null,null,null,null,null,null,null,null,null,null,null,null,null,"MONTERIA",{"$error":"#N/A"},4,2008,71074600,9677]
[null,null,null,null,null,null,null,null,null,null,null,null,null,"NEIVA","SI",4,2008,96001000,13250]
[null,null,null,null,null,null,null,null,null,null,null,null,null,"PALMIRA",{"$error":"#N/A"},4,2008,70628500,9487]
[null,null,null,null,null,null,null,null,null,null,null,null,null,"PASTO",{"$error":"#N/A"},4,2008,31474500,5296]
[null,null,null,null,null,null,null,null,null,null,null,null,null,"PEREIRA","SI",4,2008,186923150,26599]
[null,null,null,null,null,null,null,null,null,null,null,null,null,"POPAYAN",{"$error":"#N/A"},4,2008,2970000,697]
[null,null,null,null,null,null,null,null,null,null,null,null,null,"SAN ANDRES",{"$error":"#N/A"},4,2008,11925000,2021]
[null,null,null,null,null,null,null,null,null,null,null,null,null,"SANTA MARTA","SI",4,2008,102132700,15003]
[null,null,null,null,null,null,null,null,null,null,null,null,null,"SINCELEJO",{"$error":"#N/A"},4,2008,30422800,4740]
[null,null,null,null,null,null,null,null,null,null,null,null,null,"SOGAMOSO",{"$error":"#N/A"},4,2008,2563000,552]
[null,null,null,null,null,null,null,null,null,null,null,null,null,"TULUA",{"$error":"#N/A"},4,2008,38691300,6000]
[null,null,null,null,null,null,null,null,null,null,null,null,null,"TUNJA",{"$error":"#N/A"},4,2008,3116000,779]
[null,null,null,null,null,null,null,null,null,null,null,null,null,"VALLEDUPAR","SI",4,2008,1777000,509]
[null,null,null,null,null,null,null,null,null,null,null,null,null,"VILLAVICENCIO","SI",4,2008,119569866,19827]
[null,null,null,null,null,null,null,null,null,null,null,null,null,"YOPAL",{"$error":"#N/A"},4,2008,4412000,1303]
[null,null,null,null,null,null,null,null,null,null,null,null,null,"ARMENIA",{"$error":"#N/A"},5,2008,124047000,16726]
[null,null,null,null,null,null,null,null,null,null,null,null,null,"BARRANQUILLA","SI",5,2008,643791550,94493]
[null,null,null,null,null,null,null,null,null,null,null,null,null,"BELLO",{"$error":"#N/A"},5,2008,94170852,15048]
[null,null,null,null,null,null,null,null,null,null,null,null,null,"BOGOTA","SI",5,2008,6085409563,752610]
[null,null,null,null,null,null,null,null,null,null,null,null,null,"BUCARAMANGA","SI",5,2008,149834100,21162]
[null,null,null,null,null,null,null,null,null,null,null,null,null,"BUGA",{"$error":"#N/A"},5,2008,11930000,2540]
[null,null,null,null,null,null,null,null,null,null,null,null,null,"CALI","SI",5,2008,1370704500,166534]
[null,null,null,null,null,null,null,null,null,null,null,null,null,"CARTAGENA","SI",5,2008,242707000,38382]
[null,null,null,null,null,null,null,null,null,null,null,null,null,"CARTAGO",{"$error":"#N/A"},5,2008,42542500,6988]
[null,null,null,null,null,null,null,null,null,null,null,null,null,"CHIA",{"$error":"#N/A"},5,2008,196946300,25490]
[null,null,null,null,null,null,null,null,null,null,null,null,null,"CUCUTA","SI",5,2008,303641050,40705]
[null,null,null,null,null,null,null,null,null,null,null,null,null,"DUITAMA",{"$error":"#N/A"},5,2008,4352000,1088]
[null,null,null,null,null,null,null,null,null,null,null,null,null,"ENVIGADO",{"$error":"#N/A"},5,2008,1050000,175]
[null,null,null,null,null,null,null,null,null,null,null,null,null,"FLORENCIA",{"$error":"#N/A"},5,2008,9495500,2034]
[null,null,null,null,null,null,null,null,null,null,null,null,null,"FLORIDABLANCA","SI",5,2008,278268000,36457]
[null,null,null,null,null,null,null,null,null,null,null,null,null,"FUSAGASUGA",{"$error":"#N/A"},5,2008,1066000,228]
[null,null,null,null,null,null,null,null,null,null,null,null,null,"GIRARDOT",{"$error":"#N/A"},5,2008,12492000,2166]
[null,null,null,null,null,null,null,null,null,null,null,null,null,"IBAGUE","SI",5,2008,175898000,23219]
[null,null,null,null,null,null,null,null,null,null,null,null,null,"MANIZALES","SI",5,2008,132213500,17257]
[null,null,null,null,null,null,null,null,null,null,null,null,null,"MEDELLIN","SI",5,2008,1698718212,227092]
[null,null,null,null,null,null,null,null,null,null,null,null,null,"MELGAR",{"$error":"#N/A"},5,2008,1561000,338]
[null,null,null,null,null,null,null,null,null,null,null,null,null,"MONTERIA",{"$error":"#N/A"},5,2008,101904350,12589]
[null,null,null,null,null,null,null,null,null,null,null,null,null,"NEIVA","SI",5,2008,139348000,18520]
[null,null,null,null,null,null,null,null,null,null,null,null,null,"PALMIRA",{"$error":"#N/A"},5,2008,106444000,13964]
[null,null,null,null,null,null,null,null,null,null,null,null,null,"PASTO",{"$error":"#N/A"},5,2008,59960700,9381]
[null,null,null,null,null,null,null,null,null,null,null,null,null,"PEREIRA","SI",5,2008,264170700,35651]
[null,null,null,null,null,null,null,null,null,null,null,null,null,"POPAYAN",{"$error":"#N/A"},5,2008,2727000,603]
[null,null,null,null,null,null,null,null,null,null,null,null,null,"SAN ANDRES",{"$error":"#N/A"},5,2008,22326000,3468]
[null,null,null,null,null,null,null,null,null,null,null,null,null,"SANTA MARTA","SI",5,2008,157467500,21400]
[null,null,null,null,null,null,null,null,null,null,null,null,null,"SINCELEJO",{"$error":"#N/A"},5,2008,58765700,8839]
[null,null,null,null,null,null,null,null,null,null,null,null,null,"SOGAMOSO",{"$error":"#N/A"},5,2008,2008000,397]
[null,null,null,null,null,null,null,null,null,null,null,null,null,"TULUA",{"$error":"#N/A"},5,2008,57444400,8935]
[null,null,null,null,null,null,null,null,null,null,null,null,null,"TUNJA",{"$error":"#N/A"},5,2008,8476000,2119]
[null,null,null,null,null,null,null,null,null,null,null,null,null,"VALLEDUPAR","SI",5,2008,2598000,659]
[null,null,null,null,null,null,null,null,null,null,null,null,null,"VILLAVICENCIO",{"$f":"+VLOOKUP(N771,$U$2:$V$16,2,FALSE)","v":"SI"},5,2008,196652569,32209]
[null,null,null,null,null,null,null,null,null,null,null,null,null,"YOPAL",{"$error":"#N/A"},5,2008,3413000,990]
[null,null,null,null,null,null,null,null,null,null,null,null,null,"APARTADO",{"$error":"#N/A"},6,2008,47521800,7072]
[null,null,null,null,null,null,null,null,null,null,null,null,null,"ARMENIA",{"$error":"#N/A"},6,2008,174796200,24554]
[null,null,null,null,null,null,null,null,null,null,null,null,null,"BARRANQUILLA","SI",6,2008,905109700,134986]
[null,null,null,null,null,null,null,null,null,null,null,null,null,"BELLO",{"$error":"#N/A"},6,2008,142308670,24504]
[null,null,null,null,null,null,null,null,null,null,null,null,null,"BOGOTA","SI",6,2008,8262312731,1066687]
[null,null,null,null,null,null,null,null,null,null,null,null,null,"BUCARAMANGA","SI",6,2008,241566950,35143]
[null,null,null,null,null,null,null,null,null,null,null,null,null,"BUGA",{"$error":"#N/A"},6,2008,12311000,2530]
[null,null,null,null,null,null,null,null,null,null,null,null,null,"CALI","SI",6,2008,1818315950,225542]
[null,null,null,null,null,null,null,null,null,null,null,null,null,"CARTAGENA","SI",6,2008,351148200,58579]
[null,null,null,null,null,null,null,null,null,null,null,null,null,"CARTAGO",{"$error":"#N/A"},6,2008,61539000,10078]
[null,null,null,null,null,null,null,null,null,null,null,null,null,"CHIA",{"$error":"#N/A"},6,2008,293445100,39561]
[null,null,null,null,null,null,null,null,null,null,null,null,null,"CUCUTA","SI",6,2008,451177100,62220]
[null,null,null,null,null,null,null,null,null,null,null,null,null,"DUITAMA",{"$error":"#N/A"},6,2008,5944000,1486]
[null,null,null,null,null,null,null,null,null,null,null,null,null,"FLORENCIA",{"$error":"#N/A"},6,2008,13765000,3019]
[null,null,null,null,null,null,null,null,null,null,null,null,null,"FLORIDABLANCA","SI",6,2008,421054750,57658]
[null,null,null,null,null,null,null,null,null,null,null,null,null,"FUSAGASUGA",{"$error":"#N/A"},6,2008,359000,78]
[null,null,null,null,null,null,null,null,null,null,null,null,null,"GIRARDOT",{"$error":"#N/A"},6,2008,15057000,2582]
[null,null,null,null,null,null,null,null,null,null,null,null,null,"IBAGUE","SI",6,2008,267682000,36485]
[null,null,null,null,null,null,null,null,null,null,null,null,null,"MANIZALES","SI",6,2008,190331500,25482]
[null,null,null,null,null,null,null,null,null,null,null,null,null,"MEDELLIN","SI",6,2008,2315407350,320484]
[null,null,null,null,null,null,null,null,null,null,null,null,null,"MELGAR",{"$error":"#N/A"},6,2008,2735000,588]
[null,null,null,null,null,null,null,null,null,null,null,null,null,"MONTERIA",{"$error":"#N/A"},6,2008,139420950,18743]
[null,null,null,null,null,null,null,null,null,null,null,null,null,"NEIVA","SI",6,2008,196437500,26595]
[null,null,null,null,null,null,null,null,null,null,null,null,null,"PALMIRA",{"$error":"#N/A"},6,2008,148853500,19853]
[null,null,null,null,null,null,null,null,null,null,null,null,null,"PASTO",{"$error":"#N/A"},6,2008,74887000,11550]
[null,null,null,null,null,null,null,null,null,null,null,null,null,"PEREIRA","SI",6,2008,381291800,52836]
[null,null,null,null,null,null,null,null,null,null,null,null,null,"POPAYAN",{"$error":"#N/A"},6,2008,3706000,771]
[null,null,null,null,null,null,null,null,null,null,null,null,null,"SAN ANDRES",{"$error":"#N/A"},6,2008,29801000,4709]
[null,null,null,null,null,null,null,null,null,null,null,null,null,"SANTA MARTA","SI",6,2008,228493000,31751]
[null,null,null,null,null,null,null,null,null,null,null,null,null,"SINCELEJO",{"$error":"#N/A"},6,2008,79281700,12163]
[null,null,null,null,null,null,null,null,null,null,null,null,null,"SOGAMOSO",{"$error":"#N/A"},6,2008,5155000,1012]
[null,null,null,null,null,null,null,null,null,null,null,null,null,"TULUA",{"$error":"#N/A"},6,2008,67298700,10394]
[null,null,null,null,null,null,null,null,null,null,null,null,null,"TUNJA",{"$error":"#N/A"},6,2008,11420000,2855]
[null,null,null,null,null,null,null,null,null,null,null,null,null,"VALLEDUPAR","SI",6,2008,1071000,279]
[null,null,null,null,null,null,null,null,null,null,null,null,null,"VILLAVICENCIO","SI",6,2008,266317514,43229]
[null,null,null,null,null,null,null,null,null,null,null,null,null,"YOPAL",{"$error":"#N/A"},6,2008,12238500,3505]
[null,null,null,null,null,null,null,null,null,null,null,null,null,"APARTADO",{"$error":"#N/A"},7,2008,51283000,8372]
[null,null,null,null,null,null,null,null,null,null,null,null,null,"ARMENIA",{"$error":"#N/A"},7,2008,190213000,28086]
[null,null,null,null,null,null,null,null,null,null,null,null,null,"BARRANQUILLA","SI",7,2008,965738050,144258]
[null,null,null,null,null,null,null,null,null,null,null,null,null,"BELLO",{"$error":"#N/A"},7,2008,132263118,21762]
[null,null,null,null,null,null,null,null,null,null,null,null,null,"BOGOTA","SI",7,2008,8479623603,1119524]
[null,null,null,null,null,null,null,null,null,null,null,null,null,"BUCARAMANGA","SI",7,2008,263086550,40682]
[null,null,null,null,null,null,null,null,null,null,null,null,null,"BUGA",{"$error":"#N/A"},7,2008,13125000,2881]
[null,null,null,null,null,null,null,null,null,null,null,null,null,"CALI","SI",7,2008,1925020650,247711]
[null,null,null,null,null,null,null,null,null,null,null,null,null,"CARTAGENA","SI",7,2008,400330800,72173]
[null,null,null,null,null,null,null,null,null,null,null,null,null,"CARTAGO",{"$error":"#N/A"},7,2008,64077500,11047]
[null,null,null,null,null,null,null,null,null,null,null,null,null,"CHIA",{"$error":"#N/A"},7,2008,294282150,40205]
[null,null,null,null,null,null,null,null,null,null,null,null,null,"CUCUTA","SI",7,2008,440693050,62869]
[null,null,null,null,null,null,null,null,null,null,null,null,null,"DUITAMA",{"$error":"#N/A"},7,2008,6076000,1519]
[null,null,null,null,null,null,null,null,null,null,null,null,null,"FLORENCIA",{"$error":"#N/A"},7,2008,11119000,2376]
[null,null,null,null,null,null,null,null,null,null,null,null,null,"FLORIDABLANCA","SI",7,2008,454542000,66794]
[null,null,null,null,null,null,null,null,null,null,null,null,null,"FUSAGASUGA",{"$error":"#N/A"},7,2008,1435000,312]
[null,null,null,null,null,null,null,null,null,null,null,null,null,"GIRARDOT",{"$error":"#N/A"},7,2008,19344000,3504]
[null,null,null,null,null,null,null,null,null,null,null,null,null,"IBAGUE","SI",7,2008,279282500,39751]
[null,null,null,null,null,null,null,null,null,null,null,null,null,"MANIZALES","SI",7,2008,197724000,27391]
[null,null,null,null,null,null,null,null,null,null,null,null,null,"MEDELLIN","SI",7,2008,2213296724,307605]
[null,null,null,null,null,null,null,null,null,null,null,null,null,"MELGAR",{"$error":"#N/A"},7,2008,3394000,743]
[null,null,null,null,null,null,null,null,null,null,null,null,null,"MONTERIA",{"$error":"#N/A"},7,2008,189056100,27937]
[null,null,null,null,null,null,null,null,null,null,null,null,null,"NEIVA","SI",7,2008,235742500,33311]
[null,null,null,null,null,null,null,null,null,null,null,null,null,"PALMIRA",{"$error":"#N/A"},7,2008,160626500,22576]
[null,null,null,null,null,null,null,null,null,null,null,null,null,"PASTO",{"$error":"#N/A"},7,2008,86306100,12969]
[null,null,null,null,null,null,null,null,null,null,null,null,null,"PEREIRA","SI",7,2008,443862200,63416]
[null,null,null,null,null,null,null,null,null,null,null,null,null,"POPAYAN",{"$f":"+VLOOKUP(N835,$U$2:$V$16,2,FALSE)","v":{"$error":"#N/A"}},7,2008,31172600,5048]
[null,null,null,null,null,null,null,null,null,null,null,null,null,"SAN ANDRES",{"$error":"#N/A"},7,2008,27909000,4363]
[null,null,null,null,null,null,null,null,null,null,null,null,null,"SANTA MARTA","SI",7,2008,241244500,34902]
[null,null,null,null,null,null,null,null,null,null,null,null,null,"SINCELEJO",{"$error":"#N/A"},7,2008,94730700,14689]
[null,null,null,null,null,null,null,null,null,null,null,null,null,"SOGAMOSO",{"$error":"#N/A"},7,2008,3860000,757]
[null,null,null,null,null,null,null,null,null,null,null,null,null,"TULUA",{"$error":"#N/A"},7,2008,84711000,13030]
[null,null,null,null,null,null,null,null,null,null,null,null,null,"TUNJA",{"$error":"#N/A"},7,2008,5944000,1486]
[null,null,null,null,null,null,null,null,null,null,null,null,null,"VALLEDUPAR","SI",7,2008,2322000,588]
[null,null,null,null,null,null,null,null,null,null,null,null,null,"VILLAVICENCIO","SI",7,2008,249389157,41216]
[null,null,null,null,null,null,null,null,null,null,null,null,null,"YOPAL",{"$error":"#N/A"},7,2008,5293000,1568]
[null,null,null,null,null,null,null,null,null,null,null,null,null,"APARTADO",{"$error":"#N/A"},8,2008,37971000,5421]
[null,null,null,null,null,null,null,null,null,null,null,null,null,"ARMENIA",{"$error":"#N/A"},8,2008,128688100,18187]
[null,null,null,null,null,null,null,null,null,null,null,null,null,"BARRANQUILLA","SI",8,2008,725439150,105934]
[null,null,null,null,null,null,null,null,null,null,null,null,null,"BELLO",{"$error":"#N/A"},8,2008,98778900,15312]
[null,null,null,null,null,null,null,null,null,null,null,null,null,"BOGOTA","SI",8,2008,6582750811,852813]
[null,null,null,null,null,null,null,null,null,null,null,null,null,"BUCARAMANGA","SI",8,2008,176620550,26331]
[null,null,null,null,null,null,null,null,null,null,null,null,null,"BUGA",{"$error":"#N/A"},8,2008,14743000,3201]
[null,null,null,null,null,null,null,null,null,null,null,null,null,"CALI","SI",8,2008,1509557050,187064]
[null,null,null,null,null,null,null,null,null,null,null,null,null,"CARTAGENA","SI",8,2008,332110750,54976]
[null,null,null,null,null,null,null,null,null,null,null,null,null,"CARTAGO",{"$error":"#N/A"},8,2008,50324000,8377]
[null,null,null,null,null,null,null,null,null,null,null,null,null,"CHIA",{"$error":"#N/A"},8,2008,209340200,27800]
[null,null,null,null,null,null,null,null,null,null,null,null,null,"CUCUTA","SI",8,2008,360319200,53101]
[null,null,null,null,null,null,null,null,null,null,null,null,null,"DUITAMA",{"$error":"#N/A"},8,2008,4204000,1051]
[null,null,null,null,null,null,null,null,null,null,null,null,null,"FLORENCIA",{"$error":"#N/A"},8,2008,14884000,3190]
[null,null,null,null,null,null,null,null,null,null,null,null,null,"FLORIDABLANCA","SI",8,2008,331264250,46258]
[null,null,null,null,null,null,null,null,null,null,null,null,null,"FUSAGASUGA",{"$error":"#N/A"},8,2008,5046000,1101]
[null,null,null,null,null,null,null,null,null,null,null,null,null,"GIRARDOT",{"$error":"#N/A"},8,2008,9294500,1630]
[null,null,null,null,null,null,null,null,null,null,null,null,null,"IBAGUE","SI",8,2008,194500500,26242]
[null,null,null,null,null,null,null,null,null,null,null,null,null,"MANIZALES","SI",8,2008,149489500,19942]
[null,null,null,null,null,null,null,null,null,null,null,null,null,"MEDELLIN","SI",8,2008,1679386050,230517]
[null,null,null,null,null,null,null,null,null,null,null,null,null,"MELGAR",{"$error":"#N/A"},8,2008,4131000,993]
[null,null,null,null,null,null,null,null,null,null,null,null,null,"MONTERIA",{"$error":"#N/A"},8,2008,112338550,15684]
[null,null,null,null,null,null,null,null,null,null,null,null,null,"NEIVA","SI",8,2008,172197500,23552]
[null,null,null,null,null,null,null,null,null,null,null,null,null,"PALMIRA",{"$error":"#N/A"},8,2008,120573000,16261]
[null,null,null,null,null,null,null,null,null,null,null,null,null,"PASTO",{"$error":"#N/A"},8,2008,77612600,11796]
[null,null,null,null,null,null,null,null,null,null,null,null,null,"PEREIRA","SI",8,2008,292337150,40093]
[null,null,null,null,null,null,null,null,null,null,null,null,null,"POPAYAN",{"$error":"#N/A"},8,2008,161401400,23432]
[null,null,null,null,null,null,null,null,null,null,null,null,null,"SAN ANDRES",{"$error":"#N/A"},8,2008,22703000,3479]
[null,null,null,null,null,null,null,null,null,null,null,null,null,"SANTA MARTA","SI",8,2008,158656000,23780]
[null,null,null,null,null,null,null,null,null,null,null,null,null,"SINCELEJO",{"$error":"#N/A"},8,2008,67597500,10164]
[null,null,null,null,null,null,null,null,null,null,null,null,null,"SOGAMOSO",{"$error":"#N/A"},8,2008,5302000,1046]
[null,null,null,null,null,null,null,null,null,null,null,null,null,"TULUA",{"$error":"#N/A"},8,2008,55807700,8563]
[null,null,null,null,null,null,null,null,null,null,null,null,null,"TUNJA",{"$error":"#N/A"},8,2008,5056000,1264]
[null,null,null,null,null,null,null,null,null,null,null,null,null,"VALLEDUPAR","SI",8,2008,2179000,563]
[null,null,null,null,null,null,null,null,null,null,null,null,null,"VILLAVICENCIO","SI",8,2008,182043072,30546]
[null,null,null,null,null,null,null,null,null,null,null,null,null,"YOPAL",{"$error":"#N/A"},8,2008,0,0]
[null,null,null,null,null,null,null,null,null,null,null,null,null,"APARTADO",{"$error":"#N/A"},9,2008,23931600,3681]
[null,null,null,null,null,null,null,null,null,null,null,null,null,"ARMENIA",{"$error":"#N/A"},9,2008,70299200,10163]
[null,null,null,null,null,null,null,null,null,null,null,null,null,"BARRANQUILLA","SI",9,2008,389830750,57401]
[null,null,null,null,null,null,null,null,null,null,null,null,null,"BELLO",{"$error":"#N/A"},9,2008,55971500,8659]
[null,null,null,null,null,null,null,null,null,null,null,null,null,"BOGOTA","SI",9,2008,3725411699,481999]
[null,null,null,null,null,null,null,null,null,null,null,null,null,"BUCARAMANGA","SI",9,2008,90987600,13701]
[null,null,null,null,null,null,null,null,null,null,null,null,null,"BUGA",{"$error":"#N/A"},9,2008,4235000,987]
[null,null,null,null,null,null,null,null,null,null,null,null,null,"CALI","SI",9,2008,833365700,102582]
[null,null,null,null,null,null,null,null,null,null,null,null,null,"CARTAGENA","SI",9,2008,226303100,36967]
[null,null,null,null,null,null,null,null,null,null,null,null,null,"CARTAGO",{"$error":"#N/A"},9,2008,25199000,4182]
[null,null,null,null,null,null,null,null,null,null,null,null,null,"CHIA",{"$error":"#N/A"},9,2008,122514450,16593]
[null,null,null,null,null,null,null,null,null,null,null,null,null,"CUCUTA","SI",9,2008,223324200,33003]
[null,null,null,null,null,null,null,null,null,null,null,null,null,"DUITAMA",{"$error":"#N/A"},9,2008,1240000,310]
[null,null,null,null,null,null,null,null,null,null,null,null,null,"FLORENCIA",{"$error":"#N/A"},9,2008,2655500,584]
[null,null,null,null,null,null,null,null,null,null,null,null,null,"FLORIDABLANCA","SI",9,2008,170771500,24183]
[null,null,null,null,null,null,null,null,null,null,null,null,null,"FUSAGASUGA",{"$error":"#N/A"},9,2008,1154000,249]
[null,null,null,null,null,null,null,null,null,null,null,null,null,"GIRARDOT",{"$error":"#N/A"},9,2008,3556000,624]
[null,null,null,null,null,null,null,null,null,null,null,null,null,"IBAGUE","SI",9,2008,101522000,14142]
[null,null,null,null,null,null,null,null,null,null,null,null,null,"MANIZALES",{"$f":"+VLOOKUP(N899,$U$2:$V$16,2,FALSE)","v":"SI"},9,2008,65756000,8897]
[null,null,null,null,null,null,null,null,null,null,null,null,null,"MEDELLIN","SI",9,2008,1011147952,141024]
[null,null,null,null,null,null,null,null,null,null,null,null,null,"MELGAR",{"$error":"#N/A"},9,2008,1650000,403]
[null,null,null,null,null,null,null,null,null,null,null,null,null,"MONTERIA",{"$error":"#N/A"},9,2008,66226600,9083]
[null,null,null,null,null,null,null,null,null,null,null,null,null,"NEIVA","SI",9,2008,90511500,12684]
[null,null,null,null,null,null,null,null,null,null,null,null,null,"PALMIRA",{"$error":"#N/A"},9,2008,58487000,7883]
[null,null,null,null,null,null,null,null,null,null,null,null,null,"PASTO",{"$error":"#N/A"},9,2008,34169700,5232]
[null,null,null,null,null,null,null,null,null,null,null,null,null,"PEREIRA","SI",9,2008,158010700,21871]
[null,null,null,null,null,null,null,null,null,null,null,null,null,"POPAYAN",{"$error":"#N/A"},9,2008,70180800,10428]
[null,null,null,null,null,null,null,null,null,null,null,null,null,"SAN ANDRES",{"$error":"#N/A"},9,2008,12496000,1912]
[null,null,null,null,null,null,null,null,null,null,null,null,null,"SANTA MARTA","SI",9,2008,95951000,14524]
[null,null,null,null,null,null,null,null,null,null,null,null,null,"SINCELEJO",{"$error":"#N/A"},9,2008,42493100,6550]
[null,null,null,null,null,null,null,null,null,null,null,null,null,"SOGAMOSO",{"$error":"#N/A"},9,2008,2177000,434]
[null,null,null,null,null,null,null,null,null,null,null,null,null,"TULUA",{"$error":"#N/A"},9,2008,29299900,4436]
[null,null,null,null,null,null,null,null,null,null,null,null,null,"TUNJA",{"$error":"#N/A"},9,2008,2266000,567]
[null,null,null,null,null,null,null,null,null,null,null,null,null,"VALLEDUPAR","SI",9,2008,381000,104]
[null,null,null,null,null,null,null,null,null,null,null,null,null,"VILLAVICENCIO","SI",9,2008,111251059,19454]
[null,null,null,null,null,null,null,null,null,null,null,null,null,"YOPAL",{"$error":"#N/A"},9,2008,5066500,1496]
[null,null,null,null,null,null,null,null,null,null,null,null,null,"APARTADO",{"$error":"#N/A"},10,2008,26445500,4142]
[null,null,null,null,null,null,null,null,null,null,null,null,null,"ARMENIA",{"$error":"#N/A"},10,2008,105532600,15250]
[null,null,null,null,null,null,null,null,null,null,null,null,null,"BARRANQUILLA","SI",10,2008,622935650,93368]
[null,null,null,null,null,null,null,null,null,null,null,null,null,"BELLO",{"$error":"#N/A"},10,2008,92845900,14992]
[null,null,null,null,null,null,null,null,null,null,null,null,null,"BOGOTA","SI",10,2008,5342375153,691314]
[null,null,null,null,null,null,null,null,null,null,null,null,null,"BUCARAMANGA","SI",10,2008,129095800,19458]
[null,null,null,null,null,null,null,null,null,null,null,null,null,"BUGA",{"$error":"#N/A"},10,2008,3856000,919]
[null,null,null,null,null,null,null,null,null,null,null,null,null,"CALI","SI",10,2008,1251526850,156895]
[null,null,null,null,null,null,null,null,null,null,null,null,null,"CARTAGENA","SI",10,2008,313848150,51361]
[null,null,null,null,null,null,null,null,null,null,null,null,null,"CARTAGO",{"$error":"#N/A"},10,2008,46379500,7921]
[null,null,null,null,null,null,null,null,null,null,null,null,null,"CHIA",{"$error":"#N/A"},10,2008,181969700,25369]
[null,null,null,null,null,null,null,null,null,null,null,null,null,"CUCUTA","SI",10,2008,324269250,53181]
[null,null,null,null,null,null,null,null,null,null,null,null,null,"DUITAMA",{"$error":"#N/A"},10,2008,1756000,439]
[null,null,null,null,null,null,null,null,null,null,null,null,null,"FLORENCIA",{"$error":"#N/A"},10,2008,6654500,1455]
[null,null,null,null,null,null,null,null,null,null,null,null,null,"FLORIDABLANCA","SI",10,2008,264834000,47622]
[null,null,null,null,null,null,null,null,null,null,null,null,null,"FUSAGASUGA",{"$error":"#N/A"},10,2008,237000,53]
[null,null,null,null,null,null,null,null,null,null,null,null,null,"GIRARDOT",{"$error":"#N/A"},10,2008,1963000,341]
[null,null,null,null,null,null,null,null,null,null,null,null,null,"IBAGUE","SI",10,2008,152645000,26733]
[null,null,null,null,null,null,null,null,null,null,null,null,null,"MANIZALES","SI",10,2008,102905500,17925]
[null,null,null,null,null,null,null,null,null,null,null,null,null,"MEDELLIN","SI",10,2008,1435408900,211468]
[null,null,null,null,null,null,null,null,null,null,null,null,null,"MELGAR",{"$error":"#N/A"},10,2008,1337000,334]
[null,null,null,null,null,null,null,null,null,null,null,null,null,"MONTERIA",{"$error":"#N/A"},10,2008,96739900,13145]
[null,null,null,null,null,null,null,null,null,null,null,null,null,"NEIVA","SI",10,2008,126269500,23434]
[null,null,null,null,null,null,null,null,null,null,null,null,null,"PALMIRA",{"$error":"#N/A"},10,2008,92300000,16199]
[null,null,null,null,null,null,null,null,null,null,null,null,null,"PASTO",{"$error":"#N/A"},10,2008,44352900,6595]
[null,null,null,null,null,null,null,null,null,null,null,null,null,"PEREIRA","SI",10,2008,234517750,33000]
[null,null,null,null,null,null,null,null,null,null,null,null,null,"POPAYAN",{"$error":"#N/A"},10,2008,79860200,12528]
[null,null,null,null,null,null,null,null,null,null,null,null,null,"SAN ANDRES",{"$error":"#N/A"},10,2008,12994000,2186]
[null,null,null,null,null,null,null,null,null,null,null,null,null,"SANTA MARTA","SI",10,2008,125769500,21141]
[null,null,null,null,null,null,null,null,null,null,null,null,null,"SINCELEJO",{"$error":"#N/A"},10,2008,48558900,7725]
[null,null,null,null,null,null,null,null,null,null,null,null,null,"SOGAMOSO",{"$error":"#N/A"},10,2008,1497000,298]
[null,null,null,null,null,null,null,null,null,null,null,null,null,"TULUA",{"$error":"#N/A"},10,2008,28230500,4268]
[null,null,null,null,null,null,null,null,null,null,null,null,null,"TUNJA",{"$error":"#N/A"},10,2008,2208000,552]
[null,null,null,null,null,null,null,null,null,null,null,null,null,"VALLEDUPAR","SI",10,2008,704000,187]
[null,null,null,null,null,null,null,null,null,null,null,null,null,"VILLAVICENCIO","SI",10,2008,168482040,29866]
[null,null,null,null,null,null,null,null,null,null,null,null,null,"YOPAL",{"$error":"#N/A"},10,2008,3956500,1173]
[null,null,null,null,null,null,null,null,null,null,null,null,null,"APARTADO",{"$error":"#N/A"},11,2008,24574500,3874]
[null,null,null,null,null,null,null,null,null,null,null,null,null,"ARMENIA",{"$error":"#N/A"},11,2008,113250350,15838]
[null,null,null,null,null,null,null,null,null,null,null,null,null,"BARRANQUILLA","SI",11,2008,690810000,99335]
[null,null,null,null,null,null,null,null,null,null,null,null,null,"BELLO",{"$error":"#N/A"},11,2008,94465600,14842]
[null,null,null,null,null,null,null,null,null,null,null,null,null,"BOGOTA","SI",11,2008,6055174391,793781]
[null,null,null,null,null,null,null,null,null,null,null,null,null,"BUCARAMANGA","SI",11,2008,142630000,20577]
[null,null,null,null,null,null,null,null,null,null,null,null,null,"BUENAVENTURA",{"$error":"#N/A"},11,2008,35488000,2732]
[null,null,null,null,null,null,null,null,null,null,null,null,null,"BUGA",{"$error":"#N/A"},11,2008,6079000,1353]
[null,null,null,null,null,null,null,null,null,null,null,null,null,"CALI","SI",11,2008,1290004700,157584]
[null,null,null,null,null,null,null,null,null,null,null,null,null,"CARTAGENA","SI",11,2008,325542900,52043]
[null,null,null,null,null,null,null,null,null,null,null,null,null,"CARTAGO",{"$f":"+VLOOKUP(N963,$U$2:$V$16,2,FALSE)","v":{"$error":"#N/A"}},11,2008,36776000,6059]
[null,null,null,null,null,null,null,null,null,null,null,null,null,"CHIA",{"$error":"#N/A"},11,2008,204644000,27055]
[null,null,null,null,null,null,null,null,null,null,null,null,null,"CUCUTA","SI",11,2008,315636250,46228]
[null,null,null,null,null,null,null,null,null,null,null,null,null,"DUITAMA",{"$error":"#N/A"},11,2008,2356000,589]
[null,null,null,null,null,null,null,null,null,null,null,null,null,"FLORENCIA",{"$error":"#N/A"},11,2008,5216000,1118]
[null,null,null,null,null,null,null,null,null,null,null,null,null,"FLORIDABLANCA","SI",11,2008,294215750,45361]
[null,null,null,null,null,null,null,null,null,null,null,null,null,"FUSAGASUGA",{"$error":"#N/A"},11,2008,1444000,299]
[null,null,null,null,null,null,null,null,null,null,null,null,null,"GIRARDOT",{"$error":"#N/A"},11,2008,10215000,1787]
[null,null,null,null,null,null,null,null,null,null,null,null,null,"IBAGUE","SI",11,2008,174776500,26528]
[null,null,null,null,null,null,null,null,null,null,null,null,null,"MANIZALES","SI",11,2008,118593000,17994]
[null,null,null,null,null,null,null,null,null,null,null,null,null,"MEDELLIN","SI",11,2008,1613615750,226100]
[null,null,null,null,null,null,null,null,null,null,null,null,null,"MELGAR",{"$error":"#N/A"},11,2008,1841000,392]
[null,null,null,null,null,null,null,null,null,null,null,null,null,"MONTERIA",{"$error":"#N/A"},11,2008,111827950,14500]
[null,null,null,null,null,null,null,null,null,null,null,null,null,"NEIVA","SI",11,2008,145880500,23069]
[null,null,null,null,null,null,null,null,null,null,null,null,null,"PALMIRA",{"$error":"#N/A"},11,2008,84335000,12810]
[null,null,null,null,null,null,null,null,null,null,null,null,null,"PASTO",{"$error":"#N/A"},11,2008,58929500,9010]
[null,null,null,null,null,null,null,null,null,null,null,null,null,"PEREIRA","SI",11,2008,235868150,31859]
[null,null,null,null,null,null,null,null,null,null,null,null,null,"POPAYAN",{"$error":"#N/A"},11,2008,88291500,12936]
[null,null,null,null,null,null,null,null,null,null,null,null,null,"SAN ANDRES",{"$error":"#N/A"},11,2008,22569000,3761]
[null,null,null,null,null,null,null,null,null,null,null,null,null,"SANTA MARTA","SI",11,2008,135400000,20281]
[null,null,null,null,null,null,null,null,null,null,null,null,null,"SINCELEJO",{"$error":"#N/A"},11,2008,68357200,10100]
[null,null,null,null,null,null,null,null,null,null,null,null,null,"SOGAMOSO",{"$error":"#N/A"},11,2008,3491000,682]
[null,null,null,null,null,null,null,null,null,null,null,null,null,"TULUA",{"$error":"#N/A"},11,2008,42565000,6341]
[null,null,null,null,null,null,null,null,null,null,null,null,null,"TUNJA",{"$error":"#N/A"},11,2008,3344000,836]
[null,null,null,null,null,null,null,null,null,null,null,null,null,"VALLEDUPAR","SI",11,2008,22363500,2649]
[null,null,null,null,null,null,null,null,null,null,null,null,null,"VILLAVICENCIO","SI",11,2008,179722026,31618]
[null,null,null,null,null,null,null,null,null,null,null,null,null,"YOPAL",{"$error":"#N/A"},11,2008,4823500,1415]
[null,null,null,null,null,null,null,null,null,null,null,null,null,"APARTADO",{"$error":"#N/A"},12,2008,37522750,8210]
[null,null,null,null,null,null,null,null,null,null,null,null,null,"ARMENIA",{"$error":"#N/A"},12,2008,145686550,20604]
[null,null,null,null,null,null,null,null,null,null,null,null,null,"BARRANQUILLA","SI",12,2008,619450000,87798]
[null,null,null,null,null,null,null,null,null,null,null,null,null,"BELLO",{"$error":"#N/A"},12,2008,100903000,16552]
[null,null,null,null,null,null,null,null,null,null,null,null,null,"BOGOTA","SI",12,2008,6171655131,783163]
[null,null,null,null,null,null,null,null,null,null,null,null,null,"BUCARAMANGA","SI",12,2008,164403850,24432]
[null,null,null,null,null,null,null,null,null,null,null,null,null,"BUENAVENTURA",{"$error":"#N/A"},12,2008,43612000,4651]
[null,null,null,null,null,null,null,null,null,null,null,null,null,"BUGA",{"$error":"#N/A"},12,2008,2229000,475]
[null,null,null,null,null,null,null,null,null,null,null,null,null,"CALI","SI",12,2008,1202153700,141268]
[null,null,null,null,null,null,null,null,null,null,null,null,null,"CARTAGENA","SI",12,2008,341912150,57004]
[null,null,null,null,null,null,null,null,null,null,null,null,null,"CARTAGO",{"$error":"#N/A"},12,2008,42655000,7145]
[null,null,null,null,null,null,null,null,null,null,null,null,null,"CHIA",{"$error":"#N/A"},12,2008,212985250,28221]
[null,null,null,null,null,null,null,null,null,null,null,null,null,"CUCUTA","SI",12,2008,371821000,50469]
[null,null,null,null,null,null,null,null,null,null,null,null,null,"DUITAMA",{"$error":"#N/A"},12,2008,5276000,1319]
[null,null,null,null,null,null,null,null,null,null,null,null,null,"FACATATIVA",{"$error":"#N/A"},12,2008,854000,174]
[null,null,null,null,null,null,null,null,null,null,null,null,null,"FLORENCIA",{"$error":"#N/A"},12,2008,5179000,1127]
[null,null,null,null,null,null,null,null,null,null,null,null,null,"FLORIDABLANCA","SI",12,2008,351134750,49206]
[null,null,null,null,null,null,null,null,null,null,null,null,null,"FUSAGASUGA",{"$error":"#N/A"},12,2008,46000,10]
[null,null,null,null,null,null,null,null,null,null,null,null,null,"GIRARDOT",{"$error":"#N/A"},12,2008,11981500,2160]
[null,null,null,null,null,null,null,null,null,null,null,null,null,"IBAGUE","SI",12,2008,250117500,34965]
[null,null,null,null,null,null,null,null,null,null,null,null,null,"MANIZALES","SI",12,2008,158017250,21382]
[null,null,null,null,null,null,null,null,null,null,null,null,null,"MEDELLIN","SI",12,2008,1586220250,210164]
[null,null,null,null,null,null,null,null,null,null,null,null,null,"MELGAR",{"$error":"#N/A"},12,2008,5487500,1193]
[null,null,null,null,null,null,null,null,null,null,null,null,null,"MONTERIA",{"$error":"#N/A"},12,2008,125235750,16320]
[null,null,null,null,null,null,null,null,null,null,null,null,null,"NEIVA","SI",12,2008,198741750,28227]
[null,null,null,null,null,null,null,null,null,null,null,null,null,"PALMIRA",{"$error":"#N/A"},12,2008,90658000,12311]
[null,null,null,null,null,null,null,null,null,null,null,null,null,"PASTO",{"$error":"#N/A"},12,2008,59442000,9203]
[null,null,null,null,null,null,null,null,null,null,null,null,null,"PEREIRA","SI",12,2008,293824900,39561]
[null,null,null,null,null,null,null,null,null,null,null,null,null,"POPAYAN",{"$error":"#N/A"},12,2008,81266000,11765]
[null,null,null,null,null,null,null,null,null,null,null,null,null,"SAN ANDRES",{"$error":"#N/A"},12,2008,26326000,4504]
[null,null,null,null,null,null,null,null,null,null,null,null,null,"SANTA MARTA","SI",12,2008,173948500,24686]
[null,null,null,null,null,null,null,null,null,null,null,null,null,"SINCELEJO",{"$error":"#N/A"},12,2008,69908000,9804]
[null,null,null,null,null,null,null,null,null,null,null,null,null,"SOGAMOSO",{"$error":"#N/A"},12,2008,2385000,470]
[null,null,null,null,null,null,null,null,null,null,null,null,null,"TULUA",{"$error":"#N/A"},12,2008,42180000,6523]
[null,null,null,null,null,null,null,null,null,null,null,null,null,"TUNJA",{"$error":"#N/A"},12,2008,2424000,606]
[null,null,null,null,null,null,null,null,null,null,null,null,null,"VALLEDUPAR","SI",12,2008,129026500,17102]
[null,null,null,null,null,null,null,null,null,null,null,null,null,"VILLAVICENCIO","SI",12,2008,199419534,36777]
[null,null,null,null,null,null,null,null,null,null,null,null,null,"YOPAL",{"$f":"+VLOOKUP(N1027,$U$2:$V$16,2,FALSE)","v":{"$error":"#N/A"}},12,2008,605000,176]
[null,null,null,null,null,null,null,null,null,null,null,null,null,"APARTADO",{"$error":"#N/A"},1,2009,35070750,7317]
[null,null,null,null,null,null,null,null,null,null,null,null,null,"ARMENIA",{"$error":"#N/A"},1,2009,217412700,29335]
[null,null,null,null,null,null,null,null,null,null,null,null,null,"BARRANQUILLA","SI",1,2009,912311850,124500]
[null,null,null,null,null,null,null,null,null,null,null,null,null,"BELLO",{"$error":"#N/A"},1,2009,151550600,23960]
[null,null,null,null,null,null,null,null,null,null,null,null,null,"BOGOTA","SI",1,2009,9777607554,1156062]
[null,null,null,null,null,null,null,null,null,null,null,null,null,"BUCARAMANGA","SI",1,2009,240639750,34780]
[null,null,null,null,null,null,null,null,null,null,null,null,null,"BUENAVENTURA",{"$error":"#N/A"},1,2009,47866000,5042]
[null,null,null,null,null,null,null,null,null,null,null,null,null,"BUGA",{"$error":"#N/A"},1,2009,10045000,2235]
[null,null,null,null,null,null,null,null,null,null,null,null,null,"CALI","SI",1,2009,2292166050,249392]
[null,null,null,null,null,null,null,null,null,null,null,null,null,"CARTAGENA","SI",1,2009,499780500,81462]
[null,null,null,null,null,null,null,null,null,null,null,null,null,"CARTAGO",{"$error":"#N/A"},1,2009,68093300,10381]
[null,null,null,null,null,null,null,null,null,null,null,null,null,"CHIA",{"$error":"#N/A"},1,2009,306570650,37256]
[null,null,null,null,null,null,null,null,null,null,null,null,null,"CUCUTA","SI",1,2009,530349500,71231]
[null,null,null,null,null,null,null,null,null,null,null,null,null,"DUITAMA",{"$error":"#N/A"},1,2009,6568000,1642]
[null,null,null,null,null,null,null,null,null,null,null,null,null,"FACATATIVA",{"$error":"#N/A"},1,2009,2795500,707]
[null,null,null,null,null,null,null,null,null,null,null,null,null,"FLORENCIA",{"$error":"#N/A"},1,2009,13640000,2864]
[null,null,null,null,null,null,null,null,null,null,null,null,null,"FLORIDABLANCA","SI",1,2009,520395000,71890]
[null,null,null,null,null,null,null,null,null,null,null,null,null,"FUSAGASUGA",{"$error":"#N/A"},1,2009,3190000,685]
[null,null,null,null,null,null,null,null,null,null,null,null,null,"GIRARDOT",{"$error":"#N/A"},1,2009,11063000,1977]
[null,null,null,null,null,null,null,null,null,null,null,null,null,"IBAGUE","SI",1,2009,310734750,42508]
[null,null,null,null,null,null,null,null,null,null,null,null,null,"MANIZALES","SI",1,2009,208244000,27878]
[null,null,null,null,null,null,null,null,null,null,null,null,null,"MEDELLIN","SI",1,2009,2823752900,357983]
[null,null,null,null,null,null,null,null,null,null,null,null,null,"MELGAR",{"$error":"#N/A"},1,2009,4047000,924]
[null,null,null,null,null,null,null,null,null,null,null,null,null,"MONTERIA",{"$error":"#N/A"},1,2009,166078800,20637]
[null,null,null,null,null,null,null,null,null,null,null,null,null,"NEIVA","SI",1,2009,243163500,33951]
[null,null,null,null,null,null,null,null,null,null,null,null,null,"PALMIRA",{"$error":"#N/A"},1,2009,137570750,18396]
[null,null,null,null,null,null,null,null,null,null,null,null,null,"PASTO",{"$error":"#N/A"},1,2009,74480000,11200]
[null,null,null,null,null,null,null,null,null,null,null,null,null,"PEREIRA","SI",1,2009,426047950,54337]
[null,null,null,null,null,null,null,null,null,null,null,null,null,"POPAYAN",{"$error":"#N/A"},1,2009,122147500,16822]
[null,null,null,null,null,null,null,null,null,null,null,null,null,"SAN ANDRES",{"$error":"#N/A"},1,2009,23801000,3889]
[null,null,null,null,null,null,null,null,null,null,null,null,null,"SANTA MARTA","SI",1,2009,235125250,32466]
[null,null,null,null,null,null,null,null,null,null,null,null,null,"SINCELEJO",{"$error":"#N/A"},1,2009,76896000,10737]
[null,null,null,null,null,null,null,null,null,null,null,null,null,"SOGAMOSO",{"$error":"#N/A"},1,2009,5028000,993]
[null,null,null,null,null,null,null,null,null,null,null,null,null,"TULUA",{"$error":"#N/A"},1,2009,60552000,8955]
[null,null,null,null,null,null,null,null,null,null,null,null,null,"TUNJA",{"$error":"#N/A"},1,2009,5420000,1355]
[null,null,null,null,null,null,null,null,null,null,null,null,null,"VALLEDUPAR","SI",1,2009,144261000,19440]
[null,null,null,null,null,null,null,null,null,null,null,null,null,"VILLAVICENCIO","SI",1,2009,253013551,49332]
[null,null,null,null,null,null,null,null,null,null,null,null,null,"YOPAL",{"$error":"#N/A"},1,2009,4604000,1351]
[null,null,null,null,null,null,null,null,null,null,null,null,null,"ZIPAQUIRA",{"$error":"#N/A"},1,2009,25770000,5349]
[null,null,null,null,null,null,null,null,null,null,null,null,null,"APARTADO",{"$error":"#N/A"},2,2009,23064500,5056]
[null,null,null,null,null,null,null,null,null,null,null,null,null,"ARMENIA",{"$error":"#N/A"},2,2009,94248500,13019]
[null,null,null,null,null,null,null,null,null,null,null,null,null,"BARRANQUILLA","SI",2,2009,441913350,60330]
[null,null,null,null,null,null,null,null,null,null,null,null,null,"BELLO",{"$error":"#N/A"},2,2009,79955800,11870]
[null,null,null,null,null,null,null,null,null,null,null,null,null,"BOGOTA","SI",2,2009,5400536561,643937]
[null,null,null,null,null,null,null,null,null,null,null,null,null,"BUCARAMANGA","SI",2,2009,107473250,15713]
[null,null,null,null,null,null,null,null,null,null,null,null,null,"BUENAVENTURA",{"$error":"#N/A"},2,2009,25244000,3982]
[null,null,null,null,null,null,null,null,null,null,null,null,null,"BUGA",{"$error":"#N/A"},2,2009,3859000,873]
[null,null,null,null,null,null,null,null,null,null,null,null,null,"CALI","SI",2,2009,1190412100,131708]
[null,null,null,null,null,null,null,null,null,null,null,null,null,"CARTAGENA","SI",2,2009,234044350,39163]
[null,null,null,null,null,null,null,null,null,null,null,null,null,"CARTAGO",{"$error":"#N/A"},2,2009,28095100,4308]
[null,null,null,null,null,null,null,null,null,null,null,null,null,"CHIA",{"$error":"#N/A"},2,2009,160521850,19333]
[null,null,null,null,null,null,null,null,null,null,null,null,null,"CUCUTA","SI",2,2009,266734000,37102]
[null,null,null,null,null,null,null,null,null,null,null,null,null,"DUITAMA",{"$error":"#N/A"},2,2009,3192000,798]
[null,null,null,null,null,null,null,null,null,null,null,null,null,"ENVIGADO",{"$error":"#N/A"},2,2009,342000,57]
[null,null,null,null,null,null,null,null,null,null,null,null,null,"FACATATIVA",{"$error":"#N/A"},2,2009,582000,148]
[null,null,null,null,null,null,null,null,null,null,null,null,null,"FLORENCIA",{"$error":"#N/A"},2,2009,4572500,933]
[null,null,null,null,null,null,null,null,null,null,null,null,null,"FLORIDABLANCA","SI",2,2009,228738500,33171]
[null,null,null,null,null,null,null,null,null,null,null,null,null,"FUSAGASUGA",{"$error":"#N/A"},2,2009,1166000,251]
[null,null,null,null,null,null,null,null,null,null,null,null,null,"GIRARDOT",{"$error":"#N/A"},2,2009,4097000,748]
[null,null,null,null,null,null,null,null,null,null,null,null,null,"IBAGUE","SI",2,2009,127171500,18159]
[null,null,null,null,null,null,null,null,null,null,null,null,null,"MANIZALES","SI",2,2009,110474000,15384]
[null,null,null,null,null,null,null,null,null,null,null,null,null,"MEDELLIN","SI",2,2009,1587629200,205280]
[null,null,null,null,null,null,null,null,null,null,null,null,null,"MELGAR",{"$error":"#N/A"},2,2009,711500,161]
[null,null,null,null,null,null,null,null,null,null,null,null,null,"MONTERIA",{"$f":"+VLOOKUP(N1091,$U$2:$V$16,2,FALSE)","v":{"$error":"#N/A"}},2,2009,89789050,11254]
[null,null,null,null,null,null,null,null,null,null,null,null,null,"NEIVA","SI",2,2009,100297500,14665]
[null,null,null,null,null,null,null,null,null,null,null,null,null,"PALMIRA",{"$error":"#N/A"},2,2009,62124500,8693]
[null,null,null,null,null,null,null,null,null,null,null,null,null,"PASTO",{"$error":"#N/A"},2,2009,44766000,6720]
[null,null,null,null,null,null,null,null,null,null,null,null,null,"PEREIRA","SI",2,2009,199392500,25592]
[null,null,null,null,null,null,null,null,null,null,null,null,null,"POPAYAN",{"$error":"#N/A"},2,2009,42046500,6067]
[null,null,null,null,null,null,null,null,null,null,null,null,null,"SAN ANDRES",{"$error":"#N/A"},2,2009,14898000,2318]
[null,null,null,null,null,null,null,null,null,null,null,null,null,"SANTA MARTA","SI",2,2009,85066250,12169]
[null,null,null,null,null,null,null,null,null,null,null,null,null,"SINCELEJO",{"$error":"#N/A"},2,2009,38878500,5354]
[null,null,null,null,null,null,null,null,null,null,null,null,null,"SOGAMOSO",{"$error":"#N/A"},2,2009,1520000,302]
[null,null,null,null,null,null,null,null,null,null,null,null,null,"TULUA",{"$error":"#N/A"},2,2009,28037500,4224]
[null,null,null,null,null,null,null,null,null,null,null,null,null,"TUNJA",{"$error":"#N/A"},2,2009,2584000,646]
[null,null,null,null,null,null,null,null,null,null,null,null,null,"VALLEDUPAR","SI",2,2009,50057000,7298]
[null,null,null,null,null,null,null,null,null,null,null,null,null,"VILLAVICENCIO","SI",2,2009,126207467,25634]
[null,null,null,null,null,null,null,null,null,null,null,null,null,"YOPAL",{"$error":"#N/A"},2,2009,2072000,614]
[null,null,null,null,null,null,null,null,null,null,null,null,null,"ZIPAQUIRA",{"$error":"#N/A"},2,2009,10541000,1931]
[null,null,null,null,null,null,null,null,null,null,null,null,null,"APARTADO",{"$error":"#N/A"},3,2009,23657000,5128]
[null,null,null,null,null,null,null,null,null,null,null,null,null,"ARMENIA",{"$error":"#N/A"},3,2009,74230550,10027]
[null,null,null,null,null,null,null,null,null,null,null,null,null,"BARRANQUILLA","SI",3,2009,482009300,65311]
[null,null,null,null,null,null,null,null,null,null,null,null,null,"BELLO",{"$error":"#N/A"},3,2009,69390000,10215]
[null,null,null,null,null,null,null,null,null,null,null,null,null,"BOGOTA","SI",3,2009,5044200810,631777]
[null,null,null,null,null,null,null,null,null,null,null,null,null,"BUCARAMANGA","SI",3,2009,94485800,13760]
[null,null,null,null,null,null,null,null,null,null,null,null,null,"BUENAVENTURA",{"$error":"#N/A"},3,2009,33852000,5642]
[null,null,null,null,null,null,null,null,null,null,null,null,null,"BUGA",{"$error":"#N/A"},3,2009,5458000,1290]
[null,null,null,null,null,null,null,null,null,null,null,null,null,"CALI","SI",3,2009,1080635900,119867]
[null,null,null,null,null,null,null,null,null,null,null,null,null,"CARTAGENA","SI",3,2009,206667700,34938]
[null,null,null,null,null,null,null,null,null,null,null,null,null,"CARTAGO",{"$error":"#N/A"},3,2009,31339800,4807]
[null,null,null,null,null,null,null,null,null,null,null,null,null,"CHIA",{"$error":"#N/A"},3,2009,138497550,16783]
[null,null,null,null,null,null,null,null,null,null,null,null,null,"CUCUTA","SI",3,2009,254943500,34991]
[null,null,null,null,null,null,null,null,null,null,null,null,null,"DUITAMA",{"$error":"#N/A"},3,2009,2500000,625]
[null,null,null,null,null,null,null,null,null,null,null,null,null,"ENVIGADO",{"$error":"#N/A"},3,2009,84000,14]
[null,null,null,null,null,null,null,null,null,null,null,null,null,"FACATATIVA",{"$error":"#N/A"},3,2009,508000,127]
[null,null,null,null,null,null,null,null,null,null,null,null,null,"FLORENCIA",{"$error":"#N/A"},3,2009,7142500,1466]
[null,null,null,null,null,null,null,null,null,null,null,null,null,"FLORIDABLANCA","SI",3,2009,211964500,30118]
[null,null,null,null,null,null,null,null,null,null,null,null,null,"FUSAGASUGA",{"$error":"#N/A"},3,2009,880000,188]
[null,null,null,null,null,null,null,null,null,null,null,null,null,"GIRARDOT",{"$error":"#N/A"},3,2009,4111000,844]
[null,null,null,null,null,null,null,null,null,null,null,null,null,"IBAGUE","SI",3,2009,124622000,17445]
[null,null,null,null,null,null,null,null,null,null,null,null,null,"MANIZALES","SI",3,2009,88241750,12178]
[null,null,null,null,null,null,null,null,null,null,null,null,null,"MEDELLIN","SI",3,2009,1365669450,179580]
[null,null,null,null,null,null,null,null,null,null,null,null,null,"MELGAR",{"$error":"#N/A"},3,2009,543000,122]
[null,null,null,null,null,null,null,null,null,null,null,null,null,"MONTERIA",{"$error":"#N/A"},3,2009,67506150,8598]
[null,null,null,null,null,null,null,null,null,null,null,null,null,"NEIVA","SI",3,2009,102393250,15013]
[null,null,null,null,null,null,null,null,null,null,null,null,null,"PALMIRA",{"$error":"#N/A"},3,2009,59503250,8185]
[null,null,null,null,null,null,null,null,null,null,null,null,null,"PASTO",{"$error":"#N/A"},3,2009,34969000,5438]
[null,null,null,null,null,null,null,null,null,null,null,null,null,"PEREIRA","SI",3,2009,173733400,22374]
[null,null,null,null,null,null,null,null,null,null,null,null,null,"POPAYAN",{"$error":"#N/A"},3,2009,47076000,7001]
[null,null,null,null,null,null,null,null,null,null,null,null,null,"SAN ANDRES",{"$error":"#N/A"},3,2009,13047000,2125]
[null,null,null,null,null,null,null,null,null,null,null,null,null,"SANTA MARTA","SI",3,2009,105916750,15166]
[null,null,null,null,null,null,null,null,null,null,null,null,null,"SINCELEJO",{"$error":"#N/A"},3,2009,37748500,5375]
[null,null,null,null,null,null,null,null,null,null,null,null,null,"SOGAMOSO",{"$error":"#N/A"},3,2009,65000,13]
[null,null,null,null,null,null,null,null,null,null,null,null,null,"TULUA",{"$error":"#N/A"},3,2009,25076500,3782]
[null,null,null,null,null,null,null,null,null,null,null,null,null,"TUNJA",{"$error":"#N/A"},3,2009,2024000,506]
[null,null,null,null,null,null,null,null,null,null,null,null,null,"VALLEDUPAR","SI",3,2009,52938250,9678]
[null,null,null,null,null,null,null,null,null,null,null,null,null,"VILLAVICENCIO","SI",3,2009,133292034,25518]
[null,null,null,null,null,null,null,null,null,null,null,null,null,"YOPAL",{"$error":"#N/A"},3,2009,2374000,696]
[null,null,null,null,null,null,null,null,null,null,null,null,null,"ZIPAQUIRA",{"$error":"#N/A"},3,2009,11619000,2007]
[null,null,null,null,null,null,null,null,null,null,null,null,null,"APARTADO",{"$error":"#N/A"},4,2009,24348500,5017]
[null,null,null,null,null,null,null,null,null,null,null,null,null,"ARMENIA",{"$error":"#N/A"},4,2009,134565800,18715]
[null,null,null,null,null,null,null,null,null,null,null,null,null,"BARRANQUILLA","SI",4,2009,634305100,99662]
[null,null,null,null,null,null,null,null,null,null,null,null,null,"BELLO",{"$error":"#N/A"},4,2009,103496100,15416]
[null,null,null,null,null,null,null,null,null,null,null,null,null,"BOGOTA","SI",4,2009,7186780055,912120]
[null,null,null,null,null,null,null,null,null,null,null,null,null,"BUCARAMANGA","SI",4,2009,151371900,23348]
[null,null,null,null,null,null,null,null,null,null,null,null,null,"BUENAVENTURA",{"$error":"#N/A"},4,2009,41912726,7378]
[null,null,null,null,null,null,null,null,null,null,null,null,null,"BUGA",{"$error":"#N/A"},4,2009,6560000,1412]
[null,null,null,null,null,null,null,null,null,null,null,null,null,"CALI",{"$f":"+VLOOKUP(N1155,$U$2:$V$16,2,FALSE)","v":"SI"},4,2009,1502267700,174757]
[null,null,null,null,null,null,null,null,null,null,null,null,null,"CARTAGENA","SI",4,2009,380739900,67917]
[null,null,null,null,null,null,null,null,null,null,null,null,null,"CARTAGO",{"$error":"#N/A"},4,2009,49547400,7656]
[null,null,null,null,null,null,null,null,null,null,null,null,null,"CHIA",{"$error":"#N/A"},4,2009,208978150,26178]
[null,null,null,null,null,null,null,null,null,null,null,null,null,"CUCUTA","SI",4,2009,450389250,61834]
[null,null,null,null,null,null,null,null,null,null,null,null,null,"DUITAMA",{"$error":"#N/A"},4,2009,4424000,1106]
[null,null,null,null,null,null,null,null,null,null,null,null,null,"ENVIGADO",{"$error":"#N/A"},4,2009,228000,38]
[null,null,null,null,null,null,null,null,null,null,null,null,null,"FACATATIVA",{"$error":"#N/A"},4,2009,530000,143]
[null,null,null,null,null,null,null,null,null,null,null,null,null,"FLORENCIA",{"$error":"#N/A"},4,2009,7960500,1644]
[null,null,null,null,null,null,null,null,null,null,null,null,null,"FLORIDABLANCA","SI",4,2009,404192000,51004]
[null,null,null,null,null,null,null,null,null,null,null,null,null,"FUSAGASUGA",{"$error":"#N/A"},4,2009,194000,45]
[null,null,null,null,null,null,null,null,null,null,null,null,null,"GIRARDOT",{"$error":"#N/A"},4,2009,7787000,1651]
[null,null,null,null,null,null,null,null,null,null,null,null,null,"IBAGUE","SI",4,2009,215862000,29380]
[null,null,null,null,null,null,null,null,null,null,null,null,null,"MANIZALES","SI",4,2009,141682000,22091]
[null,null,null,null,null,null,null,null,null,null,null,null,null,"MEDELLIN","SI",4,2009,1654136300,221884]
[null,null,null,null,null,null,null,null,null,null,null,null,null,"MELGAR",{"$error":"#N/A"},4,2009,1956000,411]
[null,null,null,null,null,null,null,null,null,null,null,null,null,"MONTERIA",{"$error":"#N/A"},4,2009,110908700,14670]
[null,null,null,null,null,null,null,null,null,null,null,null,null,"NEIVA","SI",4,2009,187571000,26477]
[null,null,null,null,null,null,null,null,null,null,null,null,null,"PALMIRA",{"$error":"#N/A"},4,2009,116031500,18367]
[null,null,null,null,null,null,null,null,null,null,null,null,null,"PASTO",{"$error":"#N/A"},4,2009,48210000,7723]
[null,null,null,null,null,null,null,null,null,null,null,null,null,"PEREIRA","SI",4,2009,300006150,40796]
[null,null,null,null,null,null,null,null,null,null,null,null,null,"POPAYAN",{"$error":"#N/A"},4,2009,59488500,10678]
[null,null,null,null,null,null,null,null,null,null,null,null,null,"SAN ANDRES",{"$error":"#N/A"},4,2009,19540000,3184]
[null,null,null,null,null,null,null,null,null,null,null,null,null,"SANTA MARTA","SI",4,2009,146871000,23217]
[null,null,null,null,null,null,null,null,null,null,null,null,null,"SINCELEJO",{"$error":"#N/A"},4,2009,55857000,9869]
[null,null,null,null,null,null,null,null,null,null,null,null,null,"TULUA",{"$error":"#N/A"},4,2009,36581000,6287]
[null,null,null,null,null,null,null,null,null,null,null,null,null,"TUNJA",{"$error":"#N/A"},4,2009,1246000,308]
[null,null,null,null,null,null,null,null,null,null,null,null,null,"VALLEDUPAR","SI",4,2009,79731250,14647]
[null,null,null,null,null,null,null,null,null,null,null,null,null,"VILLAVICENCIO","SI",4,2009,216906531,43129]
[null,null,null,null,null,null,null,null,null,null,null,null,null,"YOPAL",{"$error":"#N/A"},4,2009,4895500,1425]
[null,null,null,null,null,null,null,null,null,null,null,null,null,"ZIPAQUIRA",{"$error":"#N/A"},4,2009,15301000,3129]
[null,null,null,null,null,null,null,null,null,null,null,null,null,"APARTADO",{"$error":"#N/A"},5,2009,36682500,7007]
[null,null,null,null,null,null,null,null,null,null,null,null,null,"ARMENIA",{"$error":"#N/A"},5,2009,154316950,20526]
[null,null,null,null,null,null,null,null,null,null,null,null,null,"BARRANQUILLA","SI",5,2009,828703450,119006]
[null,null,null,null,null,null,null,null,null,null,null,null,null,"BELLO",{"$error":"#N/A"},5,2009,131871300,19050]
[null,null,null,null,null,null,null,null,null,null,null,null,null,"BOGOTA","SI",5,2009,8158826671,1059584]
[null,null,null,null,null,null,null,null,null,null,null,null,null,"BUCARAMANGA","SI",5,2009,211843800,30734]
[null,null,null,null,null,null,null,null,null,null,null,null,null,"BUENAVENTURA",{"$error":"#N/A"},5,2009,65793935,11092]
[null,null,null,null,null,null,null,null,null,null,null,null,null,"BUGA",{"$error":"#N/A"},5,2009,8442000,1766]
[null,null,null,null,null,null,null,null,null,null,null,null,null,"CALI","SI",5,2009,1769892750,205382]
[null,null,null,null,null,null,null,null,null,null,null,null,null,"CARTAGENA","SI",5,2009,454767350,77311]
[null,null,null,null,null,null,null,null,null,null,null,null,null,"CARTAGO",{"$error":"#N/A"},5,2009,53261100,8129]
[null,null,null,null,null,null,null,null,null,null,null,null,null,"CHIA",{"$error":"#N/A"},5,2009,229495300,27285]
[null,null,null,null,null,null,null,null,null,null,null,null,null,"CUCUTA","SI",5,2009,430987750,70074]
[null,null,null,null,null,null,null,null,null,null,null,null,null,"DUITAMA",{"$error":"#N/A"},5,2009,6604000,1651]
[null,null,null,null,null,null,null,null,null,null,null,null,null,"ENVIGADO",{"$error":"#N/A"},5,2009,426000,71]
[null,null,null,null,null,null,null,null,null,null,null,null,null,"FLORENCIA",{"$error":"#N/A"},5,2009,15488500,3199]
[null,null,null,null,null,null,null,null,null,null,null,null,null,"FLORIDABLANCA","SI",5,2009,446403000,59372]
[null,null,null,null,null,null,null,null,null,null,null,null,null,"FUSAGASUGA",{"$error":"#N/A"},5,2009,2559000,641]
[null,null,null,null,null,null,null,null,null,null,null,null,null,"GIRARDOT",{"$error":"#N/A"},5,2009,12368000,2591]
[null,null,null,null,null,null,null,null,null,null,null,null,null,"IBAGUE","SI",5,2009,247110000,33167]
[null,null,null,null,null,null,null,null,null,null,null,null,null,"MANIZALES","SI",5,2009,160105000,27762]
[null,null,null,null,null,null,null,null,null,null,null,null,null,"MEDELLIN","SI",5,2009,2062058600,278363]
[null,null,null,null,null,null,null,null,null,null,null,null,null,"MELGAR",{"$error":"#N/A"},5,2009,3172000,660]
[null,null,null,null,null,null,null,null,null,null,null,null,null,"MONTERIA",{"$error":"#N/A"},5,2009,146574200,18406]
[null,null,null,null,null,null,null,null,null,null,null,null,null,"NEIVA","SI",5,2009,191331250,26501]
[null,null,null,null,null,null,null,null,null,null,null,null,null,"PALMIRA",{"$error":"#N/A"},5,2009,134638500,23823]
[null,null,null,null,null,null,null,null,null,null,null,null,null,"PASTO",{"$error":"#N/A"},5,2009,66410000,10966]
[null,null,null,null,null,null,null,null,null,null,null,null,null,"PEREIRA","SI",5,2009,323837150,42178]
[null,null,null,null,null,null,null,null,null,null,null,null,null,"POPAYAN",{"$error":"#N/A"},5,2009,88624000,14779]
[null,null,null,null,null,null,null,null,null,null,null,null,null,"SAN ANDRES",{"$error":"#N/A"},5,2009,32716000,4893]
[null,null,null,null,null,null,null,null,null,null,null,null,null,"SANTA MARTA","SI",5,2009,198161000,32428]
[null,null,null,null,null,null,null,null,null,null,null,null,null,"SINCELEJO",{"$error":"#N/A"},5,2009,74007000,12186]
[null,null,null,null,null,null,null,null,null,null,null,null,null,"TULUA",{"$error":"#N/A"},5,2009,56579000,9326]
[null,null,null,null,null,null,null,null,null,null,null,null,null,"TUNJA",{"$f":"+VLOOKUP(N1219,$U$2:$V$16,2,FALSE)","v":{"$error":"#N/A"}},5,2009,3036000,759]
[null,null,null,null,null,null,null,null,null,null,null,null,null,"VALLEDUPAR","SI",5,2009,126027750,23921]
[null,null,null,null,null,null,null,null,null,null,null,null,null,"VILLAVICENCIO","SI",5,2009,239693020,47090]
[null,null,null,null,null,null,null,null,null,null,null,null,null,"YOPAL",{"$error":"#N/A"},5,2009,3291500,959]
[null,null,null,null,null,null,null,null,null,null,null,null,null,"ZIPAQUIRA",{"$error":"#N/A"},5,2009,19744000,4936]
[null,null,null,null,null,null,null,null,null,null,null,null,null,"APARTADO",{"$error":"#N/A"},6,2009,47011500,7856]
[null,null,null,null,null,null,null,null,null,null,null,null,null,"ARMENIA",{"$error":"#N/A"},6,2009,186838850,26044]
[null,null,null,null,null,null,null,null,null,null,null,null,null,"BARRANQUILLA","SI",6,2009,911347900,127790]
[null,null,null,null,null,null,null,null,null,null,null,null,null,"BELLO",{"$error":"#N/A"},6,2009,181106400,27094]
[null,null,null,null,null,null,null,null,null,null,null,null,null,"BOGOTA","SI",6,2009,10239229800,1290525]
[null,null,null,null,null,null,null,null,null,null,null,null,null,"BUCARAMANGA","SI",6,2009,260786550,39022]
[null,null,null,null,null,null,null,null,null,null,null,null,null,"BUENAVENTURA",{"$error":"#N/A"},6,2009,81661259,13972]
[null,null,null,null,null,null,null,null,null,null,null,null,null,"BUGA",{"$error":"#N/A"},6,2009,11562000,2430]
[null,null,null,null,null,null,null,null,null,null,null,null,null,"CALI","SI",6,2009,2205265950,243769]
[null,null,null,null,null,null,null,null,null,null,null,null,null,"CARTAGENA","SI",6,2009,485056500,85466]
[null,null,null,null,null,null,null,null,null,null,null,null,null,"CARTAGO",{"$error":"#N/A"},6,2009,69742900,10732]
[null,null,null,null,null,null,null,null,null,null,null,null,null,"CAUCASIA",{"$error":"#N/A"},6,2009,14029000,2426]
[null,null,null,null,null,null,null,null,null,null,null,null,null,"CHIA",{"$error":"#N/A"},6,2009,278397950,34391]
[null,null,null,null,null,null,null,null,null,null,null,null,null,"CUCUTA","SI",6,2009,622947000,88571]
[null,null,null,null,null,null,null,null,null,null,null,null,null,"DUITAMA",{"$error":"#N/A"},6,2009,9712000,2428]
[null,null,null,null,null,null,null,null,null,null,null,null,null,"FLORENCIA",{"$error":"#N/A"},6,2009,18756000,3793]
[null,null,null,null,null,null,null,null,null,null,null,null,null,"FLORIDABLANCA","SI",6,2009,645368250,75561]
[null,null,null,null,null,null,null,null,null,null,null,null,null,"FUSAGASUGA",{"$error":"#N/A"},6,2009,7480000,1546]
[null,null,null,null,null,null,null,null,null,null,null,null,null,"GIRARDOT",{"$error":"#N/A"},6,2009,14071000,3106]
[null,null,null,null,null,null,null,null,null,null,null,null,null,"IBAGUE","SI",6,2009,277381250,38013]
[null,null,null,null,null,null,null,null,null,null,null,null,null,"MANIZALES","SI",6,2009,185948250,33123]
[null,null,null,null,null,null,null,null,null,null,null,null,null,"MEDELLIN","SI",6,2009,2807218150,353747]
[null,null,null,null,null,null,null,null,null,null,null,null,null,"MELGAR",{"$error":"#N/A"},6,2009,5808000,1290]
[null,null,null,null,null,null,null,null,null,null,null,null,null,"MONTERIA",{"$error":"#N/A"},6,2009,159508350,21259]
[null,null,null,null,null,null,null,null,null,null,null,null,null,"NEIVA","SI",6,2009,226420750,32202]
[null,null,null,null,null,null,null,null,null,null,null,null,null,"PALMIRA",{"$error":"#N/A"},6,2009,155868500,27851]
[null,null,null,null,null,null,null,null,null,null,null,null,null,"PASTO",{"$error":"#N/A"},6,2009,112887500,19192]
[null,null,null,null,null,null,null,null,null,null,null,null,null,"PEREIRA","SI",6,2009,410724700,54152]
[null,null,null,null,null,null,null,null,null,null,null,null,null,"POPAYAN",{"$error":"#N/A"},6,2009,119261000,18673]
[null,null,null,null,null,null,null,null,null,null,null,null,null,"SAN ANDRES",{"$error":"#N/A"},6,2009,43054000,6233]
[null,null,null,null,null,null,null,null,null,null,null,null,null,"SANTA MARTA","SI",6,2009,218953000,35107]
[null,null,null,null,null,null,null,null,null,null,null,null,null,"SINCELEJO",{"$error":"#N/A"},6,2009,82305000,13200]
[null,null,null,null,null,null,null,null,null,null,null,null,null,"TULUA",{"$error":"#N/A"},6,2009,74820000,12389]
[null,null,null,null,null,null,null,null,null,null,null,null,null,"TUNJA",{"$error":"#N/A"},6,2009,10592000,2698]
[null,null,null,null,null,null,null,null,null,null,null,null,null,"VALLEDUPAR","SI",6,2009,138221250,27742]
[null,null,null,null,null,null,null,null,null,null,null,null,null,"VILLAVICENCIO","SI",6,2009,312548755,62527]
[null,null,null,null,null,null,null,null,null,null,null,null,null,"YOPAL",{"$error":"#N/A"},6,2009,13275500,3810]
[null,null,null,null,null,null,null,null,null,null,null,null,null,"ZIPAQUIRA",{"$error":"#N/A"},6,2009,35668000,8917]
[null,null,null,null,null,null,null,null,null,null,null,null,null,"APARTADO",{"$error":"#N/A"},7,2009,52158000,8612]
[null,null,null,null,null,null,null,null,null,null,null,null,null,"ARMENIA",{"$error":"#N/A"},7,2009,244792000,34524]
[null,null,null,null,null,null,null,null,null,null,null,null,null,"BARRANQUILLA","SI",7,2009,1131702050,159172]
[null,null,null,null,null,null,null,null,null,null,null,null,null,"BELLO",{"$error":"#N/A"},7,2009,180269800,26958]
[null,null,null,null,null,null,null,null,null,null,null,null,null,"BOGOTA","SI",7,2009,12670541394,1630142]
[null,null,null,null,null,null,null,null,null,null,null,null,null,"BUCARAMANGA","SI",7,2009,323828450,49608]
[null,null,null,null,null,null,null,null,null,null,null,null,null,"BUENAVENTURA",{"$error":"#N/A"},7,2009,75508351,13052]
[null,null,null,null,null,null,null,null,null,null,null,null,null,"BUGA",{"$error":"#N/A"},7,2009,8022000,1664]
[null,null,null,null,null,null,null,null,null,null,null,null,null,"CALI","SI",7,2009,2684945800,306251]
[null,null,null,null,null,null,null,null,null,null,null,null,null,"CARTAGENA","SI",7,2009,566904500,104011]
[null,null,null,null,null,null,null,null,null,null,null,null,null,"CARTAGO",{"$error":"#N/A"},7,2009,74789700,11591]
[null,null,null,null,null,null,null,null,null,null,null,null,null,"CAUCASIA",{"$error":"#N/A"},7,2009,36842000,6401]
[null,null,null,null,null,null,null,null,null,null,null,null,null,"CHIA",{"$error":"#N/A"},7,2009,341323650,42105]
[null,null,null,null,null,null,null,null,null,null,null,null,null,"CUCUTA","SI",7,2009,667103500,93275]
[null,null,null,null,null,null,null,null,null,null,null,null,null,"DUITAMA",{"$error":"#N/A"},7,2009,20636000,5159]
[null,null,null,null,null,null,null,null,null,null,null,null,null,"ENVIGADO",{"$error":"#N/A"},7,2009,198000,33]
[null,null,null,null,null,null,null,null,null,null,null,null,null,"FLORENCIA",{"$error":"#N/A"},7,2009,24263500,4887]
[null,null,null,null,null,null,null,null,null,null,null,null,null,"FLORIDABLANCA","SI",7,2009,749953250,88808]
[null,null,null,null,null,null,null,null,null,null,null,null,null,"FUSAGASUGA",{"$error":"#N/A"},7,2009,6617000,1391]
[null,null,null,null,null,null,null,null,null,null,null,null,null,"GIRARDOT",{"$error":"#N/A"},7,2009,19595000,4274]
[null,null,null,null,null,null,null,null,null,null,null,null,null,"IBAGUE","SI",7,2009,389306000,54767]
[null,null,null,null,null,null,null,null,null,null,null,null,null,"MANIZALES",{"$f":"+VLOOKUP(N1283,$U$2:$V$16,2,FALSE)","v":"SI"},7,2009,254009250,46997]
[null,null,null,null,null,null,null,null,null,null,null,null,null,"MEDELLIN","SI",7,2009,3200965100,390185]
[null,null,null,null,null,null,null,null,null,null,null,null,null,"MELGAR",{"$error":"#N/A"},7,2009,10810000,2411]
[null,null,null,null,null,null,null,null,null,null,null,null,null,"MONTERIA",{"$error":"#N/A"},7,2009,198665950,27546]
[null,null,null,null,null,null,null,null,null,null,null,null,null,"NEIVA","SI",7,2009,308638250,44742]
[null,null,null,null,null,null,null,null,null,null,null,null,null,"PALMIRA",{"$error":"#N/A"},7,2009,186385750,34316]
[null,null,null,null,null,null,null,null,null,null,null,null,null,"PASTO",{"$error":"#N/A"},7,2009,132668000,22860]
[null,null,null,null,null,null,null,null,null,null,null,null,null,"PEREIRA","SI",7,2009,528881450,72090]
[null,null,null,null,null,null,null,null,null,null,null,null,null,"POPAYAN",{"$error":"#N/A"},7,2009,136223000,21444]
[null,null,null,null,null,null,null,null,null,null,null,null,null,"SAN ANDRES",{"$error":"#N/A"},7,2009,40230000,6762]
[null,null,null,null,null,null,null,null,null,null,null,null,null,"SANTA MARTA","SI",7,2009,261528000,42266]
[null,null,null,null,null,null,null,null,null,null,null,null,null,"SINCELEJO",{"$error":"#N/A"},7,2009,105238000,17107]
[null,null,null,null,null,null,null,null,null,null,null,null,null,"TULUA",{"$error":"#N/A"},7,2009,92766000,15729]
[null,null,null,null,null,null,null,null,null,null,null,null,null,"TUNJA",{"$error":"#N/A"},7,2009,5336000,1334]
[null,null,null,null,null,null,null,null,null,null,null,null,null,"VALLEDUPAR","SI",7,2009,154879750,30948]
[null,null,null,null,null,null,null,null,null,null,null,null,null,"VILLAVICENCIO","SI",7,2009,371580593,75233]
[null,null,null,null,null,null,null,null,null,null,null,null,null,"YOPAL",{"$error":"#N/A"},7,2009,9903000,2875]
[null,null,null,null,null,null,null,null,null,null,null,null,null,"ZIPAQUIRA",{"$error":"#N/A"},7,2009,44852000,11213]
[null,null,null,null,null,null,null,null,null,null,null,null,null,"APARTADO",{"$error":"#N/A"},8,2009,31681000,5249]
[null,null,null,null,null,null,null,null,null,null,null,null,null,"ARMENIA",{"$error":"#N/A"},8,2009,139912700,19284]
[null,null,null,null,null,null,null,null,null,null,null,null,null,"BARRANQUILLA","SI",8,2009,749189200,102577]
[null,null,null,null,null,null,null,null,null,null,null,null,null,"BELLO",{"$error":"#N/A"},8,2009,116491800,17090]
[null,null,null,null,null,null,null,null,null,null,null,null,null,"BOGOTA","SI",8,2009,7500701926,963609]
[null,null,null,null,null,null,null,null,null,null,null,null,null,"BUCARAMANGA","SI",8,2009,170286200,24847]
[null,null,null,null,null,null,null,null,null,null,null,null,null,"BUENAVENTURA",{"$error":"#N/A"},8,2009,63104956,10911]
[null,null,null,null,null,null,null,null,null,null,null,null,null,"BUGA",{"$error":"#N/A"},8,2009,13485000,2862]
[null,null,null,null,null,null,null,null,null,null,null,null,null,"CALI","SI",8,2009,1786566850,200207]
[null,null,null,null,null,null,null,null,null,null,null,null,null,"CARTAGENA","SI",8,2009,367115950,64913]
[null,null,null,null,null,null,null,null,null,null,null,null,null,"CARTAGO",{"$error":"#N/A"},8,2009,43298700,6674]
[null,null,null,null,null,null,null,null,null,null,null,null,null,"CAUCASIA",{"$error":"#N/A"},8,2009,21818000,3829]
[null,null,null,null,null,null,null,null,null,null,null,null,null,"CHIA",{"$error":"#N/A"},8,2009,191870850,23248]
[null,null,null,null,null,null,null,null,null,null,null,null,null,"CUCUTA","SI",8,2009,409593750,61577]
[null,null,null,null,null,null,null,null,null,null,null,null,null,"DUITAMA",{"$error":"#N/A"},8,2009,6544000,1636]
[null,null,null,null,null,null,null,null,null,null,null,null,null,"ENVIGADO",{"$error":"#N/A"},8,2009,1506000,251]
[null,null,null,null,null,null,null,null,null,null,null,null,null,"FLORENCIA",{"$error":"#N/A"},8,2009,13822500,2808]
[null,null,null,null,null,null,null,null,null,null,null,null,null,"FLORIDABLANCA","SI",8,2009,433321500,51304]
[null,null,null,null,null,null,null,null,null,null,null,null,null,"FUSAGASUGA",{"$error":"#N/A"},8,2009,4989000,1072]
[null,null,null,null,null,null,null,null,null,null,null,null,null,"GIRARDOT",{"$error":"#N/A"},8,2009,4565000,948]
[null,null,null,null,null,null,null,null,null,null,null,null,null,"IBAGUE","SI",8,2009,189273500,25956]
[null,null,null,null,null,null,null,null,null,null,null,null,null,"MANIZALES","SI",8,2009,146985750,26113]
[null,null,null,null,null,null,null,null,null,null,null,null,null,"MEDELLIN","SI",8,2009,1944611500,239268]
[null,null,null,null,null,null,null,null,null,null,null,null,null,"MELGAR",{"$error":"#N/A"},8,2009,3658000,835]
[null,null,null,null,null,null,null,null,null,null,null,null,null,"MONTERIA",{"$error":"#N/A"},8,2009,125858800,15954]
[null,null,null,null,null,null,null,null,null,null,null,null,null,"NEIVA","SI",8,2009,151408500,21534]
[null,null,null,null,null,null,null,null,null,null,null,null,null,"PALMIRA",{"$error":"#N/A"},8,2009,113286250,20360]
[null,null,null,null,null,null,null,null,null,null,null,null,null,"PASTO",{"$error":"#N/A"},8,2009,56953000,9794]
[null,null,null,null,null,null,null,null,null,null,null,null,null,"PEREIRA","SI",8,2009,274431250,36353]
[null,null,null,null,null,null,null,null,null,null,null,null,null,"POPAYAN",{"$error":"#N/A"},8,2009,79825500,12480]
[null,null,null,null,null,null,null,null,null,null,null,null,null,"SAN ANDRES",{"$error":"#N/A"},8,2009,22796000,3934]
[null,null,null,null,null,null,null,null,null,null,null,null,null,"SANTA MARTA","SI",8,2009,141124750,23023]
[null,null,null,null,null,null,null,null,null,null,null,null,null,"SINCELEJO",{"$error":"#N/A"},8,2009,60733000,9671]
[null,null,null,null,null,null,null,null,null,null,null,null,null,"TULUA",{"$error":"#N/A"},8,2009,49017000,8055]
[null,null,null,null,null,null,null,null,null,null,null,null,null,"TUNJA",{"$error":"#N/A"},8,2009,5524000,1381]
[null,null,null,null,null,null,null,null,null,null,null,null,null,"VALLEDUPAR","SI",8,2009,97777000,19207]
[null,null,null,null,null,null,null,null,null,null,null,null,null,"VILLAVICENCIO","SI",8,2009,225957315,45043]
[null,null,null,null,null,null,null,null,null,null,null,null,null,"YOPAL",{"$error":"#N/A"},8,2009,7597500,2208]
[null,null,null,null,null,null,null,null,null,null,null,null,null,"ZIPAQUIRA",{"$error":"#N/A"},8,2009,19384000,4846]
[null,null,null,null,null,null,null,null,null,null,null,null,null,"APARTADO",{"$error":"#N/A"},9,2009,21150500,3536]
[null,null,null,null,null,null,null,null,null,null,null,null,null,"ARMENIA",{"$error":"#N/A"},9,2009,75762300,11135]
[null,null,null,null,null,null,null,null,null,null,null,null,null,"BARRANQUILLA","SI",9,2009,467780050,67223]
[null,null,null,null,null,null,null,null,null,null,null,null,null,"BELLO",{"$error":"#N/A"},9,2009,63278600,9369]
[null,null,null,null,null,null,null,null,null,null,null,null,null,"BOGOTA","SI",9,2009,4608370200,627485]
[null,null,null,null,null,null,null,null,null,null,null,null,null,"BUCARAMANGA","SI",9,2009,87296950,14086]
[null,null,null,null,null,null,null,null,null,null,null,null,null,"BUENAVENTURA",{"$error":"#N/A"},9,2009,38458597,7069]
[null,null,null,null,null,null,null,null,null,null,null,null,null,"BUGA",{"$f":"+VLOOKUP(N1347,$U$2:$V$16,2,FALSE)","v":{"$error":"#N/A"}},9,2009,3792000,854]
[null,null,null,null,null,null,null,null,null,null,null,null,null,"CALI","SI",9,2009,1023768200,117681]
[null,null,null,null,null,null,null,null,null,null,null,null,null,"CARTAGENA","SI",9,2009,268889550,62606]
[null,null,null,null,null,null,null,null,null,null,null,null,null,"CARTAGO",{"$error":"#N/A"},9,2009,24672900,3827]
[null,null,null,null,null,null,null,null,null,null,null,null,null,"CAUCASIA",{"$error":"#N/A"},9,2009,10661000,1945]
[null,null,null,null,null,null,null,null,null,null,null,null,null,"CHIA",{"$error":"#N/A"},9,2009,112167550,13946]
[null,null,null,null,null,null,null,null,null,null,null,null,null,"CUCUTA","SI",9,2009,275449250,41297]
[null,null,null,null,null,null,null,null,null,null,null,null,null,"DUITAMA",{"$error":"#N/A"},9,2009,2580000,645]
[null,null,null,null,null,null,null,null,null,null,null,null,null,"ENVIGADO",{"$error":"#N/A"},9,2009,480000,80]
[null,null,null,null,null,null,null,null,null,null,null,null,null,"FLORENCIA",{"$error":"#N/A"},9,2009,6002000,1196]
[null,null,null,null,null,null,null,null,null,null,null,null,null,"FLORIDABLANCA","SI",9,2009,270889750,33460]
[null,null,null,null,null,null,null,null,null,null,null,null,null,"FUSAGASUGA",{"$error":"#N/A"},9,2009,2374000,529]
[null,null,null,null,null,null,null,null,null,null,null,null,null,"GIRARDOT",{"$error":"#N/A"},9,2009,3012000,1004]
[null,null,null,null,null,null,null,null,null,null,null,null,null,"IBAGUE","SI",9,2009,124126750,17434]
[null,null,null,null,null,null,null,null,null,null,null,null,null,"MANIZALES","SI",9,2009,75990500,13760]
[null,null,null,null,null,null,null,null,null,null,null,null,null,"MEDELLIN","SI",9,2009,1244599750,159233]
[null,null,null,null,null,null,null,null,null,null,null,null,null,"MELGAR",{"$error":"#N/A"},9,2009,1463000,338]
[null,null,null,null,null,null,null,null,null,null,null,null,null,"MONTERIA",{"$error":"#N/A"},9,2009,78932200,10547]
[null,null,null,null,null,null,null,null,null,null,null,null,null,"NEIVA","SI",9,2009,99674750,14479]
[null,null,null,null,null,null,null,null,null,null,null,null,null,"PALMIRA",{"$error":"#N/A"},9,2009,63588250,11604]
[null,null,null,null,null,null,null,null,null,null,null,null,null,"PASTO",{"$error":"#N/A"},9,2009,28340000,5787]
[null,null,null,null,null,null,null,null,null,null,null,null,null,"PEREIRA","SI",9,2009,160923500,22346]
[null,null,null,null,null,null,null,null,null,null,null,null,null,"POPAYAN",{"$error":"#N/A"},9,2009,36067500,6078]
[null,null,null,null,null,null,null,null,null,null,null,null,null,"SAN ANDRES",{"$error":"#N/A"},9,2009,11734500,1710]
[null,null,null,null,null,null,null,null,null,null,null,null,null,"SANTA MARTA","SI",9,2009,91623750,15900]
[null,null,null,null,null,null,null,null,null,null,null,null,null,"SINCELEJO",{"$error":"#N/A"},9,2009,37632000,6567]
[null,null,null,null,null,null,null,null,null,null,null,null,null,"TULUA",{"$error":"#N/A"},9,2009,19712000,3728]
[null,null,null,null,null,null,null,null,null,null,null,null,null,"TUNJA",{"$error":"#N/A"},9,2009,76389750,13822]
[null,null,null,null,null,null,null,null,null,null,null,null,null,"VALLEDUPAR","SI",9,2009,61462500,12021]
[null,null,null,null,null,null,null,null,null,null,null,null,null,"VILLAVICENCIO","SI",9,2009,139170200,29999]
[null,null,null,null,null,null,null,null,null,null,null,null,null,"YOPAL",{"$error":"#N/A"},9,2009,1768000,520]
[null,null,null,null,null,null,null,null,null,null,null,null,null,"ZIPAQUIRA",{"$error":"#N/A"},9,2009,11652000,2913]
[null,null,null,null,null,null,null,null,null,null,null,null,null,"APARTADO",{"$error":"#N/A"},10,2009,21507500,3591]
[null,null,null,null,null,null,null,null,null,null,null,null,null,"ARMENIA",{"$error":"#N/A"},10,2009,88524700,12594]
[null,null,null,null,null,null,null,null,null,null,null,null,null,"BARRANQUILLA","SI",10,2009,630717450,87774]
[null,null,null,null,null,null,null,null,null,null,null,null,null,"BELLO",{"$error":"#N/A"},10,2009,84315100,12479]
[null,null,null,null,null,null,null,null,null,null,null,null,null,"BOGOTA","SI",10,2009,6392052000,906143]
[null,null,null,null,null,null,null,null,null,null,null,null,null,"BUCARAMANGA","SI",10,2009,126557200,23787]
[null,null,null,null,null,null,null,null,null,null,null,null,null,"BUENAVENTURA",{"$error":"#N/A"},10,2009,46331862,9421]
[null,null,null,null,null,null,null,null,null,null,null,null,null,"BUGA",{"$error":"#N/A"},10,2009,5569000,1236]
[null,null,null,null,null,null,null,null,null,null,null,null,null,"CALI","SI",10,2009,1201225150,134435]
[null,null,null,null,null,null,null,null,null,null,null,null,null,"CARTAGENA","SI",10,2009,308074700,72042]
[null,null,null,null,null,null,null,null,null,null,null,null,null,"CARTAGO",{"$error":"#N/A"},10,2009,33315100,5122]
[null,null,null,null,null,null,null,null,null,null,null,null,null,"CAUCASIA",{"$error":"#N/A"},10,2009,12615000,2523]
[null,null,null,null,null,null,null,null,null,null,null,null,null,"CHIA",{"$error":"#N/A"},10,2009,145886300,18070]
[null,null,null,null,null,null,null,null,null,null,null,null,null,"CUCUTA","SI",10,2009,374182500,61363]
[null,null,null,null,null,null,null,null,null,null,null,null,null,"DUITAMA",{"$error":"#N/A"},10,2009,2152000,538]
[null,null,null,null,null,null,null,null,null,null,null,null,null,"ENVIGADO",{"$error":"#N/A"},10,2009,426000,71]
[null,null,null,null,null,null,null,null,null,null,null,null,null,"FLORENCIA",{"$error":"#N/A"},10,2009,7015500,1424]
[null,null,null,null,null,null,null,null,null,null,null,null,null,"FLORIDABLANCA","SI",10,2009,343758500,40382]
[null,null,null,null,null,null,null,null,null,null,null,null,null,"FUSAGASUGA",{"$error":"#N/A"},10,2009,2496000,518]
[null,null,null,null,null,null,null,null,null,null,null,null,null,"GIRARDOT",{"$error":"#N/A"},10,2009,2412000,804]
[null,null,null,null,null,null,null,null,null,null,null,null,null,"IBAGUE","SI",10,2009,172887750,24193]
[null,null,null,null,null,null,null,null,null,null,null,null,null,"MANIZALES","SI",10,2009,121718250,21893]
[null,null,null,null,null,null,null,null,null,null,null,null,null,"MEDELLIN","SI",10,2009,1565263200,199939]
[null,null,null,null,null,null,null,null,null,null,null,null,null,"MELGAR",{"$error":"#N/A"},10,2009,2371000,517]
[null,null,null,null,null,null,null,null,null,null,null,null,null,"MONTERIA",{"$error":"#N/A"},10,2009,98404300,12734]
[null,null,null,null,null,null,null,null,null,null,null,null,null,"NEIVA","SI",10,2009,146444500,20912]
[null,null,null,null,null,null,null,null,null,null,null,null,null,"PALMIRA",{"$error":"#N/A"},10,2009,70454750,13076]
[null,null,null,null,null,null,null,null,null,null,null,null,null,"PASTO",{"$error":"#N/A"},10,2009,33777000,9615]
[null,null,null,null,null,null,null,null,null,null,null,null,null,"PEREIRA","SI",10,2009,191217900,28594]
[null,null,null,null,null,null,null,null,null,null,null,null,null,"POPAYAN",{"$error":"#N/A"},10,2009,57368000,10268]
[null,null,null,null,null,null,null,null,null,null,null,null,null,"SAN ANDRES",{"$error":"#N/A"},10,2009,17461000,2366]
[null,null,null,null,null,null,null,null,null,null,null,null,null,"SANTA MARTA","SI",10,2009,133324250,25209]
[null,null,null,null,null,null,null,null,null,null,null,null,null,"SANTA ROSA",{"$f":"+VLOOKUP(N1411,$U$2:$V$16,2,FALSE)","v":{"$error":"#N/A"}},10,2009,11500,4]
[null,null,null,null,null,null,null,null,null,null,null,null,null,"SINCELEJO",{"$error":"#N/A"},10,2009,48367000,9226]
[null,null,null,null,null,null,null,null,null,null,null,null,null,"TULUA",{"$error":"#N/A"},10,2009,23760000,6998]
[null,null,null,null,null,null,null,null,null,null,null,null,null,"TUNJA",{"$error":"#N/A"},10,2009,104209500,20175]
[null,null,null,null,null,null,null,null,null,null,null,null,null,"VALLEDUPAR","SI",10,2009,82527000,16625]
[null,null,null,null,null,null,null,null,null,null,null,null,null,"VILLAVICENCIO","SI",10,2009,222409000,70440]
[null,null,null,null,null,null,null,null,null,null,null,null,null,"YOPAL",{"$error":"#N/A"},10,2009,2823500,835]
[null,null,null,null,null,null,null,null,null,null,null,null,null,"ZIPAQUIRA",{"$error":"#N/A"},10,2009,13292000,3323]
[null,null,null,null,null,null,null,null,null,null,null,null,null,"APARTADO",{"$error":"#N/A"},11,2009,39923500,6642]
[null,null,null,null,null,null,null,null,null,null,null,null,null,"ARMENIA",{"$error":"#N/A"},11,2009,173892850,23655]
[null,null,null,null,null,null,null,null,null,null,null,null,null,"BARRANQUILLA","SI",11,2009,843223250,123044]
[null,null,null,null,null,null,null,null,null,null,null,null,null,"BELLO",{"$error":"#N/A"},11,2009,146839400,21086]
[null,null,null,null,null,null,null,null,null,null,null,null,null,"BOGOTA","SI",11,2009,8456845925,1313213]
[null,null,null,null,null,null,null,null,null,null,null,null,null,"BUCARAMANGA","SI",11,2009,217128700,39469]
[null,null,null,null,null,null,null,null,null,null,null,null,null,"BUENAVENTURA",{"$error":"#N/A"},11,2009,79400184,19694]
[null,null,null,null,null,null,null,null,null,null,null,null,null,"BUGA",{"$error":"#N/A"},11,2009,20842000,4400]
[null,null,null,null,null,null,null,null,null,null,null,null,null,"CALI","SI",11,2009,1793754000,210785]
[null,null,null,null,null,null,null,null,null,null,null,null,null,"CARTAGENA","SI",11,2009,417785700,105396]
[null,null,null,null,null,null,null,null,null,null,null,null,null,"CARTAGO",{"$error":"#N/A"},11,2009,69871700,10701]
[null,null,null,null,null,null,null,null,null,null,null,null,null,"CAUCASIA",{"$error":"#N/A"},11,2009,16462000,3604]
[null,null,null,null,null,null,null,null,null,null,null,null,null,"CHIA",{"$error":"#N/A"},11,2009,198380250,24310]
[null,null,null,null,null,null,null,null,null,null,null,null,null,"CUCUTA","SI",11,2009,450942250,82628]
[null,null,null,null,null,null,null,null,null,null,null,null,null,"DUITAMA",{"$error":"#N/A"},11,2009,7080000,1770]
[null,null,null,null,null,null,null,null,null,null,null,null,null,"ENVIGADO",{"$error":"#N/A"},11,2009,504000,84]
[null,null,null,null,null,null,null,null,null,null,null,null,null,"FLORENCIA",{"$error":"#N/A"},11,2009,8153500,1687]
[null,null,null,null,null,null,null,null,null,null,null,null,null,"FLORIDABLANCA","SI",11,2009,419183750,64669]
[null,null,null,null,null,null,null,null,null,null,null,null,null,"FUSAGASUGA",{"$error":"#N/A"},11,2009,2612000,553]
[null,null,null,null,null,null,null,null,null,null,null,null,null,"GIRARDOT",{"$error":"#N/A"},11,2009,13584000,4528]
[null,null,null,null,null,null,null,null,null,null,null,null,null,"IBAGUE","SI",11,2009,208447250,39534]
[null,null,null,null,null,null,null,null,null,null,null,null,null,"MANIZALES","SI",11,2009,172138500,31188]
[null,null,null,null,null,null,null,null,null,null,null,null,null,"MEDELLIN","SI",11,2009,2214690450,294527]
[null,null,null,null,null,null,null,null,null,null,null,null,null,"MELGAR",{"$error":"#N/A"},11,2009,4980000,1073]
[null,null,null,null,null,null,null,null,null,null,null,null,null,"MONTERIA",{"$error":"#N/A"},11,2009,142494750,18214]
[null,null,null,null,null,null,null,null,null,null,null,null,null,"NEIVA","SI",11,2009,218780750,31135]
[null,null,null,null,null,null,null,null,null,null,null,null,null,"PALMIRA",{"$error":"#N/A"},11,2009,134424250,24205]
[null,null,null,null,null,null,null,null,null,null,null,null,null,"PASTO",{"$error":"#N/A"},11,2009,59930500,18329]
[null,null,null,null,null,null,null,null,null,null,null,null,null,"PEREIRA","SI",11,2009,347796200,54508]
[null,null,null,null,null,null,null,null,null,null,null,null,null,"POPAYAN",{"$error":"#N/A"},11,2009,98364000,17533]
[null,null,null,null,null,null,null,null,null,null,null,null,null,"SAN ANDRES",{"$error":"#N/A"},11,2009,43750000,5696]
[null,null,null,null,null,null,null,null,null,null,null,null,null,"SANTA MARTA","SI",11,2009,187407250,37625]
[null,null,null,null,null,null,null,null,null,null,null,null,null,"SINCELEJO",{"$error":"#N/A"},11,2009,62109000,12068]
[null,null,null,null,null,null,null,null,null,null,null,null,null,"TULUA",{"$error":"#N/A"},11,2009,41457000,13741]
[null,null,null,null,null,null,null,null,null,null,null,null,null,"TUNJA",{"$error":"#N/A"},11,2009,115840750,22205]
[null,null,null,null,null,null,null,null,null,null,null,null,null,"VALLEDUPAR","SI",11,2009,115930750,23819]
[null,null,null,null,null,null,null,null,null,null,null,null,null,"VILLAVICENCIO","SI",11,2009,254248600,84628]
[null,null,null,null,null,null,null,null,null,null,null,null,null,"YOPAL",{"$error":"#N/A"},11,2009,10976000,3201]
[null,null,null,null,null,null,null,null,null,null,null,null,null,"ZIPAQUIRA",{"$error":"#N/A"},11,2009,28040000,7010]
[null,null,null,null,null,null,null,null,null,null,null,null,null,"APARTADO",{"$error":"#N/A"},12,2009,38212500,6644]
[null,null,null,null,null,null,null,null,null,null,null,null,null,"ARMENIA",{"$error":"#N/A"},12,2009,238527350,28406]
[null,null,null,null,null,null,null,null,null,null,null,null,null,"BARRANQUILLA","SI",12,2009,904021350,120046]
[null,null,null,null,null,null,null,null,null,null,null,null,null,"BELLO",{"$error":"#N/A"},12,2009,147539600,21786]
[null,null,null,null,null,null,null,null,null,null,null,null,null,"BOGOTA","SI",12,2009,9415667956,1330707]
[null,null,null,null,null,null,null,null,null,null,null,null,null,"BUCARAMANGA","SI",12,2009,234748700,47918]
[null,null,null,null,null,null,null,null,null,null,null,null,null,"BUENAVENTURA",{"$error":"#N/A"},12,2009,75400449,16951]
[null,null,null,null,null,null,null,null,null,null,null,null,null,"BUGA",{"$error":"#N/A"},12,2009,13324000,2824]
[null,null,null,null,null,null,null,null,null,null,null,null,null,"CALI","SI",12,2009,1974336750,231095]
[null,null,null,null,null,null,null,null,null,null,null,null,null,"CARTAGENA","SI",12,2009,504784900,123040]
[null,null,null,null,null,null,null,null,null,null,null,null,null,"CARTAGO",{"$error":"#N/A"},12,2009,55016900,10060]
[null,null,null,null,null,null,null,null,null,null,null,null,null,"CAUCASIA",{"$error":"#N/A"},12,2009,14302000,3386]
[null,null,null,null,null,null,null,null,null,null,null,null,null,"CHIA",{"$error":"#N/A"},12,2009,186994600,22697]
[null,null,null,null,null,null,null,null,null,null,null,null,null,"CUCUTA","SI",12,2009,481897500,81254]
[null,null,null,null,null,null,null,null,null,null,null,null,null,"DUITAMA",{"$error":"#N/A"},12,2009,9764000,2441]
[null,null,null,null,null,null,null,null,null,null,null,null,null,"ENVIGADO",{"$error":"#N/A"},12,2009,234000,39]
[null,null,null,null,null,null,null,null,null,null,null,null,null,"FLORENCIA",{"$error":"#N/A"},12,2009,20795000,4145]
[null,null,null,null,null,null,null,null,null,null,null,null,null,"FLORIDABLANCA",{"$f":"+VLOOKUP(N1475,$U$2:$V$16,2,FALSE)","v":"SI"},12,2009,492328250,68940]
[null,null,null,null,null,null,null,null,null,null,null,null,null,"FUSAGASUGA",{"$error":"#N/A"},12,2009,4824000,1044]
[null,null,null,null,null,null,null,null,null,null,null,null,null,"GIRARDOT",{"$error":"#N/A"},12,2009,10236000,3412]
[null,null,null,null,null,null,null,null,null,null,null,null,null,"IBAGUE","SI",12,2009,245111250,45911]
[null,null,null,null,null,null,null,null,null,null,null,null,null,"MANIZALES","SI",12,2009,194668250,35099]
[null,null,null,null,null,null,null,null,null,null,null,null,null,"MEDELLIN","SI",12,2009,2265475900,276471]
[null,null,null,null,null,null,null,null,null,null,null,null,null,"MELGAR",{"$error":"#N/A"},12,2009,6514000,1543]
[null,null,null,null,null,null,null,null,null,null,null,null,null,"MONTERIA",{"$error":"#N/A"},12,2009,183487200,22801]
[null,null,null,null,null,null,null,null,null,null,null,null,null,"NEIVA","SI",12,2009,245290250,35862]
[null,null,null,null,null,null,null,null,null,null,null,null,null,"PALMIRA",{"$error":"#N/A"},12,2009,122444250,21721]
[null,null,null,null,null,null,null,null,null,null,null,null,null,"PASTO",{"$error":"#N/A"},12,2009,66864000,18061]
[null,null,null,null,null,null,null,null,null,null,null,null,null,"PEREIRA","SI",12,2009,411037250,57981]
[null,null,null,null,null,null,null,null,null,null,null,null,null,"PITALITO",{"$error":"#N/A"},12,2009,29398000,4920]
[null,null,null,null,null,null,null,null,null,null,null,null,null,"POPAYAN",{"$error":"#N/A"},12,2009,93580000,16360]
[null,null,null,null,null,null,null,null,null,null,null,null,null,"SAN ANDRES",{"$error":"#N/A"},12,2009,40282000,5436]
[null,null,null,null,null,null,null,null,null,null,null,null,null,"SANTA MARTA","SI",12,2009,197403750,36969]
[null,null,null,null,null,null,null,null,null,null,null,null,null,"SINCELEJO",{"$error":"#N/A"},12,2009,73443000,14803]
[null,null,null,null,null,null,null,null,null,null,null,null,null,"SOGAMOSO",{"$error":"#N/A"},12,2009,1493000,241]
[null,null,null,null,null,null,null,null,null,null,null,null,null,"TULUA",{"$error":"#N/A"},12,2009,54558000,16064]
[null,null,null,null,null,null,null,null,null,null,null,null,null,"TUNJA",{"$error":"#N/A"},12,2009,119087750,22665]
[null,null,null,null,null,null,null,null,null,null,null,null,null,"VALLEDUPAR","SI",12,2009,134287500,26375]
[null,null,null,null,null,null,null,null,null,null,null,null,null,"VILLAVICENCIO","SI",12,2009,308636700,83050]
[null,null,null,null,null,null,null,null,null,null,null,null,null,"YOPAL",{"$error":"#N/A"},12,2009,3861500,1152]
[null,null,null,null,null,null,null,null,null,null,null,null,null,"ZIPAQUIRA",{"$error":"#N/A"},12,2009,26792000,6698]
[null,null,null,null,null,null,null,null,null,null,null,null,null,"APARTADO",{"$error":"#N/A"},1,2010,42102500,6998]
[null,null,null,null,null,null,null,null,null,null,null,null,null,"ARMENIA",{"$error":"#N/A"},1,2010,372871650,39371]
[null,null,null,null,null,null,null,null,null,null,null,null,null,"BARRANQUILLA","SI",1,2010,1204927900,151756]
[null,null,null,null,null,null,null,null,null,null,null,null,null,"BELLO",{"$error":"#N/A"},1,2010,187429600,27126]
[null,null,null,null,null,null,null,null,null,null,null,null,null,"BOGOTA","SI",1,2010,14019160688,1829435]
[null,null,null,null,null,null,null,null,null,null,null,null,null,"BUCARAMANGA","SI",1,2010,311976100,63423]
[null,null,null,null,null,null,null,null,null,null,null,null,null,"BUENAVENTURA",{"$error":"#N/A"},1,2010,99079575,20629]
[null,null,null,null,null,null,null,null,null,null,null,null,null,"BUGA",{"$error":"#N/A"},1,2010,13325000,2870]
[null,null,null,null,null,null,null,null,null,null,null,null,null,"CALI","SI",1,2010,3504689250,408010]
[null,null,null,null,null,null,null,null,null,null,null,null,null,"CARTAGENA","SI",1,2010,714597550,159176]
[null,null,null,null,null,null,null,null,null,null,null,null,null,"CARTAGO",{"$error":"#N/A"},1,2010,78177600,11311]
[null,null,null,null,null,null,null,null,null,null,null,null,null,"CAUCASIA",{"$error":"#N/A"},1,2010,21148500,4236]
[null,null,null,null,null,null,null,null,null,null,null,null,null,"CHIA",{"$error":"#N/A"},1,2010,234250150,27434]
[null,null,null,null,null,null,null,null,null,null,null,null,null,"CUCUTA","SI",1,2010,714860000,111538]
[null,null,null,null,null,null,null,null,null,null,null,null,null,"DUITAMA",{"$error":"#N/A"},1,2010,7996000,1999]
[null,null,null,null,null,null,null,null,null,null,null,null,null,"ENVIGADO",{"$error":"#N/A"},1,2010,3546000,591]
[null,null,null,null,null,null,null,null,null,null,null,null,null,"FLORENCIA",{"$error":"#N/A"},1,2010,23838000,4120]
[null,null,null,null,null,null,null,null,null,null,null,null,null,"FLORIDABLANCA","SI",1,2010,717403750,93232]
[null,null,null,null,null,null,null,null,null,null,null,null,null,"FUSAGASUGA",{"$error":"#N/A"},1,2010,8789000,1966]
[null,null,null,null,null,null,null,null,null,null,null,null,null,"GIRARDOT",{"$error":"#N/A"},1,2010,11214000,3738]
[null,null,null,null,null,null,null,null,null,null,null,null,null,"IBAGUE","SI",1,2010,324032250,58589]
[null,null,null,null,null,null,null,null,null,null,null,null,null,"MANIZALES","SI",1,2010,261590000,44041]
[null,null,null,null,null,null,null,null,null,null,null,null,null,"MEDELLIN","SI",1,2010,3840439550,434990]
[null,null,null,null,null,null,null,null,null,null,null,null,null,"MELGAR",{"$error":"#N/A"},1,2010,6571000,1584]
[null,null,null,null,null,null,null,null,null,null,null,null,null,"MONTERIA",{"$error":"#N/A"},1,2010,247065850,27521]
[null,null,null,null,null,null,null,null,null,null,null,null,null,"NEIVA","SI",1,2010,299947500,42947]
[null,null,null,null,null,null,null,null,null,null,null,null,null,"PALMIRA",{"$error":"#N/A"},1,2010,184448750,30828]
[null,null,null,null,null,null,null,null,null,null,null,null,null,"PASTO",{"$error":"#N/A"},1,2010,86334000,20390]
[null,null,null,null,null,null,null,null,null,null,null,null,null,"PEREIRA","SI",1,2010,673062150,85337]
[null,null,null,null,null,null,null,null,null,null,null,null,null,"PITALITO",{"$error":"#N/A"},1,2010,51674000,8502]
[null,null,null,null,null,null,null,null,null,null,null,null,null,"POPAYAN",{"$error":"#N/A"},1,2010,112602500,19578]
[null,null,null,null,null,null,null,null,null,null,null,null,null,"SAN ANDRES",{"$error":"#N/A"},1,2010,30721000,4061]
[null,null,null,null,null,null,null,null,null,null,null,null,null,"SANTA MARTA","SI",1,2010,270762000,46848]
[null,null,null,null,null,null,null,null,null,null,null,null,null,"SINCELEJO",{"$error":"#N/A"},1,2010,82700000,16139]
[null,null,null,null,null,null,null,null,null,null,null,null,null,"SOGAMOSO",{"$error":"#N/A"},1,2010,5154000,840]
[null,null,null,null,null,null,null,null,null,null,null,null,null,"TULUA",{"$error":"#N/A"},1,2010,62293000,16946]
[null,null,null,null,null,null,null,null,null,null,null,null,null,"TUNJA",{"$error":"#N/A"},1,2010,171385500,31716]
[null,null,null,null,null,null,null,null,null,null,null,null,null,"VALLEDUPAR","SI",1,2010,177048000,34054]
[null,null,null,null,null,null,null,null,null,null,null,null,null,"VILLAVICENCIO","SI",1,2010,381442000,85881]
[null,null,null,null,null,null,null,null,null,null,null,null,null,"YOPAL",{"$error":"#N/A"},1,2010,10080000,2330]
[null,null,null,null,null,null,null,null,null,null,null,null,null,"ZIPAQUIRA",{"$f":"+VLOOKUP(N1539,$U$2:$V$16,2,FALSE)","v":{"$error":"#N/A"}},1,2010,44968000,11242]
[null,null,null,null,null,null,null,null,null,null,null,null,null,"APARTADO",{"$error":"#N/A"},2,2010,24778500,4028]
[null,null,null,null,null,null,null,null,null,null,null,null,null,"ARMENIA",{"$error":"#N/A"},2,2010,154410400,16724]
[null,null,null,null,null,null,null,null,null,null,null,null,null,"BARRANQUILLA","SI",2,2010,579425450,73417]
[null,null,null,null,null,null,null,null,null,null,null,null,null,"BELLO",{"$error":"#N/A"},2,2010,85946300,12230]
[null,null,null,null,null,null,null,null,null,null,null,null,null,"BOGOTA","SI",2,2010,7102266801,899557]
[null,null,null,null,null,null,null,null,null,null,null,null,null,"BUCARAMANGA","SI",2,2010,159107550,32184]
[null,null,null,null,null,null,null,null,null,null,null,null,null,"BUENAVENTURA",{"$error":"#N/A"},2,2010,52116500,14722]
[null,null,null,null,null,null,null,null,null,null,null,null,null,"BUGA",{"$error":"#N/A"},2,2010,5142000,1264]
[null,null,null,null,null,null,null,null,null,null,null,null,null,"CALI","SI",2,2010,1659441200,202636]
[null,null,null,null,null,null,null,null,null,null,null,null,null,"CARTAGENA","SI",2,2010,323036500,73665]
[null,null,null,null,null,null,null,null,null,null,null,null,null,"CARTAGO",{"$error":"#N/A"},2,2010,34843500,5088]
[null,null,null,null,null,null,null,null,null,null,null,null,null,"CAUCASIA",{"$error":"#N/A"},2,2010,8130000,1626]
[null,null,null,null,null,null,null,null,null,null,null,null,null,"CHIA",{"$error":"#N/A"},2,2010,44522000,5194]
[null,null,null,null,null,null,null,null,null,null,null,null,null,"CUCUTA","SI",2,2010,303050500,48629]
[null,null,null,null,null,null,null,null,null,null,null,null,null,"DUITAMA",{"$error":"#N/A"},2,2010,4460000,1115]
[null,null,null,null,null,null,null,null,null,null,null,null,null,"ENVIGADO",{"$error":"#N/A"},2,2010,1650000,275]
[null,null,null,null,null,null,null,null,null,null,null,null,null,"FLORENCIA",{"$error":"#N/A"},2,2010,10309500,1744]
[null,null,null,null,null,null,null,null,null,null,null,null,null,"FLORIDABLANCA","SI",2,2010,362915500,44788]
[null,null,null,null,null,null,null,null,null,null,null,null,null,"FUSAGASUGA",{"$error":"#N/A"},2,2010,3236500,801]
[null,null,null,null,null,null,null,null,null,null,null,null,null,"GIRARDOT",{"$error":"#N/A"},2,2010,3045000,1015]
[null,null,null,null,null,null,null,null,null,null,null,null,null,"IBAGUE","SI",2,2010,152180750,27103]
[null,null,null,null,null,null,null,null,null,null,null,null,null,"MANIZALES","SI",2,2010,123908750,21026]
[null,null,null,null,null,null,null,null,null,null,null,null,null,"MEDELLIN","SI",2,2010,2093574350,231588]
[null,null,null,null,null,null,null,null,null,null,null,null,null,"MELGAR",{"$error":"#N/A"},2,2010,1495500,367]
[null,null,null,null,null,null,null,null,null,null,null,null,null,"MONTERIA",{"$error":"#N/A"},2,2010,111325100,12637]
[null,null,null,null,null,null,null,null,null,null,null,null,null,"NEIVA","SI",2,2010,126396500,18132]
[null,null,null,null,null,null,null,null,null,null,null,null,null,"PALMIRA",{"$error":"#N/A"},2,2010,81821250,13690]
[null,null,null,null,null,null,null,null,null,null,null,null,null,"PASTO",{"$error":"#N/A"},2,2010,46119000,11115]
[null,null,null,null,null,null,null,null,null,null,null,null,null,"PEREIRA","SI",2,2010,339020300,41276]
[null,null,null,null,null,null,null,null,null,null,null,null,null,"PITALITO",{"$error":"#N/A"},2,2010,20461400,3384]
[null,null,null,null,null,null,null,null,null,null,null,null,null,"POPAYAN",{"$error":"#N/A"},2,2010,45797000,7968]
[null,null,null,null,null,null,null,null,null,null,null,null,null,"SAN ANDRES",{"$error":"#N/A"},2,2010,15114000,2011]
[null,null,null,null,null,null,null,null,null,null,null,null,null,"SANTA MARTA","SI",2,2010,134489750,23237]
[null,null,null,null,null,null,null,null,null,null,null,null,null,"SINCELEJO",{"$error":"#N/A"},2,2010,45959000,9444]
[null,null,null,null,null,null,null,null,null,null,null,null,null,"SOGAMOSO",{"$error":"#N/A"},2,2010,2050000,336]
[null,null,null,null,null,null,null,null,null,null,null,null,null,"TULUA",{"$error":"#N/A"},2,2010,35986000,9659]
[null,null,null,null,null,null,null,null,null,null,null,null,null,"TUNJA",{"$error":"#N/A"},2,2010,74042750,13375]
[null,null,null,null,null,null,null,null,null,null,null,null,null,"VALLEDUPAR","SI",2,2010,80701000,14759]
[null,null,null,null,null,null,null,null,null,null,null,null,null,"VILLAVICENCIO","SI",2,2010,191536000,43388]
[null,null,null,null,null,null,null,null,null,null,null,null,null,"YOPAL",{"$error":"#N/A"},2,2010,4224500,962]
[null,null,null,null,null,null,null,null,null,null,null,null,null,"ZIPAQUIRA",{"$error":"#N/A"},2,2010,15532000,3883]
[null,null,null,null,null,null,null,null,null,null,null,null,null,"APARTADO",{"$error":"#N/A"},3,2010,31942500,5346]
[null,null,null,null,null,null,null,null,null,null,null,null,null,"ARMENIA",{"$error":"#N/A"},3,2010,217627500,22769]
[null,null,null,null,null,null,null,null,null,null,null,null,null,"BARRANQUILLA","SI",3,2010,973621550,116941]
[null,null,null,null,null,null,null,null,null,null,null,null,null,"BELLO",{"$error":"#N/A"},3,2010,111419100,16136]
[null,null,null,null,null,null,null,null,null,null,null,null,null,"BOGOTA","SI",3,2010,10209289705,1236675]
[null,null,null,null,null,null,null,null,null,null,null,null,null,"BUCARAMANGA","SI",3,2010,354338500,71091]
[null,null,null,null,null,null,null,null,null,null,null,null,null,"BUENAVENTURA",{"$error":"#N/A"},3,2010,67117875,16113]
[null,null,null,null,null,null,null,null,null,null,null,null,null,"BUGA",{"$error":"#N/A"},3,2010,6238000,1640]
[null,null,null,null,null,null,null,null,null,null,null,null,null,"CALI","SI",3,2010,2168448550,246394]
[null,null,null,null,null,null,null,null,null,null,null,null,null,"CARTAGENA","SI",3,2010,446451800,83821]
[null,null,null,null,null,null,null,null,null,null,null,null,null,"CARTAGO",{"$error":"#N/A"},3,2010,46372300,6878]
[null,null,null,null,null,null,null,null,null,null,null,null,null,"CAUCASIA",{"$error":"#N/A"},3,2010,9672500,1939]
[null,null,null,null,null,null,null,null,null,null,null,null,null,"CHIA",{"$error":"#N/A"},3,2010,57630500,6823]
[null,null,null,null,null,null,null,null,null,null,null,null,null,"CUCUTA","SI",3,2010,453381250,65137]
[null,null,null,null,null,null,null,null,null,null,null,null,null,"DUITAMA",{"$error":"#N/A"},3,2010,9824000,2456]
[null,null,null,null,null,null,null,null,null,null,null,null,null,"ENVIGADO",{"$error":"#N/A"},3,2010,474000,79]
[null,null,null,null,null,null,null,null,null,null,null,null,null,"FACATATIVA",{"$error":"#N/A"},3,2010,1870000,374]
[null,null,null,null,null,null,null,null,null,null,null,null,null,"FLORENCIA",{"$error":"#N/A"},3,2010,11409000,1973]
[null,null,null,null,null,null,null,null,null,null,null,null,null,"FLORIDABLANCA","SI",3,2010,427143250,50425]
[null,null,null,null,null,null,null,null,null,null,null,null,null,"FUSAGASUGA",{"$error":"#N/A"},3,2010,6401500,1547]
[null,null,null,null,null,null,null,null,null,null,null,null,null,"GIRARDOT",{"$error":"#N/A"},3,2010,6011000,1990]
[null,null,null,null,null,null,null,null,null,null,null,null,null,"IBAGUE","SI",3,2010,196011750,34469]
[null,null,null,null,null,null,null,null,null,null,null,null,null,"MANIZALES",{"$f":"+VLOOKUP(N1603,$U$2:$V$16,2,FALSE)","v":"SI"},3,2010,159395000,27206]
[null,null,null,null,null,null,null,null,null,null,null,null,null,"MEDELLIN","SI",3,2010,2639414650,291956]
[null,null,null,null,null,null,null,null,null,null,null,null,null,"MELGAR",{"$error":"#N/A"},3,2010,2607000,664]
[null,null,null,null,null,null,null,null,null,null,null,null,null,"MONTERIA",{"$error":"#N/A"},3,2010,143849650,15814]
[null,null,null,null,null,null,null,null,null,null,null,null,null,"NEIVA","SI",3,2010,166966000,24244]
[null,null,null,null,null,null,null,null,null,null,null,null,null,"PALMIRA",{"$error":"#N/A"},3,2010,103658250,17508]
[null,null,null,null,null,null,null,null,null,null,null,null,null,"PASTO",{"$error":"#N/A"},3,2010,57126000,13937]
[null,null,null,null,null,null,null,null,null,null,null,null,null,"PEREIRA","SI",3,2010,413063500,51988]
[null,null,null,null,null,null,null,null,null,null,null,null,null,"PITALITO",{"$error":"#N/A"},3,2010,20348900,3417]
[null,null,null,null,null,null,null,null,null,null,null,null,null,"POPAYAN",{"$error":"#N/A"},3,2010,79397000,13851]
[null,null,null,null,null,null,null,null,null,null,null,null,null,"SAN ANDRES",{"$error":"#N/A"},3,2010,21259500,2999]
[null,null,null,null,null,null,null,null,null,null,null,null,null,"SANTA MARTA","SI",3,2010,184804750,31614]
[null,null,null,null,null,null,null,null,null,null,null,null,null,"SINCELEJO",{"$error":"#N/A"},3,2010,70547000,15117]
[null,null,null,null,null,null,null,null,null,null,null,null,null,"SOGAMOSO",{"$error":"#N/A"},3,2010,794000,139]
[null,null,null,null,null,null,null,null,null,null,null,null,null,"TULUA",{"$error":"#N/A"},3,2010,51215000,13844]
[null,null,null,null,null,null,null,null,null,null,null,null,null,"TUNJA",{"$error":"#N/A"},3,2010,99727750,18157]
[null,null,null,null,null,null,null,null,null,null,null,null,null,"VALLEDUPAR","SI",3,2010,106568000,19630]
[null,null,null,null,null,null,null,null,null,null,null,null,null,"VILLAVICENCIO","SI",3,2010,270629000,61664]
[null,null,null,null,null,null,null,null,null,null,null,null,null,"YOPAL",{"$error":"#N/A"},3,2010,6860000,1564]
[null,null,null,null,null,null,null,null,null,null,null,null,null,"ZIPAQUIRA",{"$error":"#N/A"},3,2010,23720000,5930]
[null,null,null,null,null,null,null,null,null,null,null,null,null,"APARTADO",{"$error":"#N/A"},4,2010,32838000,5288]
[null,null,null,null,null,null,null,null,null,null,null,null,null,"ARMENIA",{"$error":"#N/A"},4,2010,184963000,19170]
[null,null,null,null,null,null,null,null,null,null,null,null,null,"BARRANQUILLA","SI",4,2010,859518450,108778]
[null,null,null,null,null,null,null,null,null,null,null,null,null,"BELLO",{"$error":"#N/A"},4,2010,111222700,16141]
[null,null,null,null,null,null,null,null,null,null,null,null,null,"BOGOTA","SI",4,2010,8764628158,1046921]
[null,null,null,null,null,null,null,null,null,null,null,null,null,"BUCARAMANGA","SI",4,2010,316005250,64418]
[null,null,null,null,null,null,null,null,null,null,null,null,null,"BUENAVENTURA",{"$error":"#N/A"},4,2010,68055750,16870]
[null,null,null,null,null,null,null,null,null,null,null,null,null,"BUGA",{"$error":"#N/A"},4,2010,6064000,1516]
[null,null,null,null,null,null,null,null,null,null,null,null,null,"CALI","SI",4,2010,1826817400,213045]
[null,null,null,null,null,null,null,null,null,null,null,null,null,"CARTAGENA","SI",4,2010,459183300,76993]
[null,null,null,null,null,null,null,null,null,null,null,null,null,"CARTAGO",{"$error":"#N/A"},4,2010,45266200,6652]
[null,null,null,null,null,null,null,null,null,null,null,null,null,"CAUCASIA",{"$error":"#N/A"},4,2010,11595000,2322]
[null,null,null,null,null,null,null,null,null,null,null,null,null,"CHIA",{"$error":"#N/A"},4,2010,48487000,5588]
[null,null,null,null,null,null,null,null,null,null,null,null,null,"CUCUTA","SI",4,2010,440211450,65592]
[null,null,null,null,null,null,null,null,null,null,null,null,null,"DUITAMA",{"$error":"#N/A"},4,2010,728000,182]
[null,null,null,null,null,null,null,null,null,null,null,null,null,"ENVIGADO",{"$error":"#N/A"},4,2010,210000,35]
[null,null,null,null,null,null,null,null,null,null,null,null,null,"FACATATIVA",{"$error":"#N/A"},4,2010,25960000,5192]
[null,null,null,null,null,null,null,null,null,null,null,null,null,"FLORENCIA",{"$error":"#N/A"},4,2010,12847000,2259]
[null,null,null,null,null,null,null,null,null,null,null,null,null,"FLORIDABLANCA","SI",4,2010,387738750,45313]
[null,null,null,null,null,null,null,null,null,null,null,null,null,"FUSAGASUGA",{"$error":"#N/A"},4,2010,4815000,1157]
[null,null,null,null,null,null,null,null,null,null,null,null,null,"GIRARDOT",{"$error":"#N/A"},4,2010,5793000,1931]
[null,null,null,null,null,null,null,null,null,null,null,null,null,"IBAGUE","SI",4,2010,197016500,35107]
[null,null,null,null,null,null,null,null,null,null,null,null,null,"MANIZALES","SI",4,2010,147540250,24658]
[null,null,null,null,null,null,null,null,null,null,null,null,null,"MEDELLIN","SI",4,2010,2265421223,254277]
[null,null,null,null,null,null,null,null,null,null,null,null,null,"MELGAR",{"$error":"#N/A"},4,2010,2480000,592]
[null,null,null,null,null,null,null,null,null,null,null,null,null,"MONTERIA",{"$error":"#N/A"},4,2010,142397150,15079]
[null,null,null,null,null,null,null,null,null,null,null,null,null,"NEIVA","SI",4,2010,184550000,28599]
[null,null,null,null,null,null,null,null,null,null,null,null,null,"PALMIRA",{"$error":"#N/A"},4,2010,103847250,17962]
[null,null,null,null,null,null,null,null,null,null,null,null,null,"PASTO",{"$error":"#N/A"},4,2010,56248000,13537]
[null,null,null,null,null,null,null,null,null,null,null,null,null,"PEREIRA","SI",4,2010,373488250,49372]
[null,null,null,null,null,null,null,null,null,null,null,null,null,"PITALITO",{"$error":"#N/A"},4,2010,20026300,3704]
[null,null,null,null,null,null,null,null,null,null,null,null,null,"POPAYAN",{"$error":"#N/A"},4,2010,71605000,12534]
[null,null,null,null,null,null,null,null,null,null,null,null,null,"SAN ANDRES",{"$error":"#N/A"},4,2010,24419500,3538]
[null,null,null,null,null,null,null,null,null,null,null,null,null,"SANTA MARTA","SI",4,2010,184814000,31758]
[null,null,null,null,null,null,null,null,null,null,null,null,null,"SINCELEJO",{"$error":"#N/A"},4,2010,62074000,16993]
[null,null,null,null,null,null,null,null,null,null,null,null,null,"SOGAMOSO",{"$error":"#N/A"},4,2010,1321000,244]
[null,null,null,null,null,null,null,null,null,null,null,null,null,"TULUA",{"$error":"#N/A"},4,2010,47636000,12663]
[null,null,null,null,null,null,null,null,null,null,null,null,null,"TUNJA",{"$error":"#N/A"},4,2010,86632500,15594]
[null,null,null,null,null,null,null,null,null,null,null,null,null,"VALLEDUPAR","SI",4,2010,99842500,18242]
[null,null,null,null,null,null,null,null,null,null,null,null,null,"VILLAVICENCIO","SI",4,2010,260701500,59965]
[null,null,null,null,null,null,null,null,null,null,null,null,null,"YOPAL",{"$error":"#N/A"},4,2010,6967500,1593]
[null,null,null,null,null,null,null,null,null,null,null,null,null,"ZIPAQUIRA",{"$error":"#N/A"},4,2010,21590000,5377]
[null,null,null,null,null,null,null,null,null,null,null,null,null,"APARTADO",{"$error":"#N/A"},5,2010,38326000,6134]
[null,null,null,null,null,null,null,null,null,null,null,null,null,"ARMENIA",{"$error":"#N/A"},5,2010,150703600,16822]
[null,null,null,null,null,null,null,null,null,null,null,null,null,"BARRANQUILLA",{"$f":"+VLOOKUP(N1667,$U$2:$V$16,2,FALSE)","v":"SI"},5,2010,785329650,110757]
[null,null,null,null,null,null,null,null,null,null,null,null,null,"BELLO",{"$error":"#N/A"},5,2010,124344200,17822]
[null,null,null,null,null,null,null,null,null,null,null,null,null,"BOGOTA","SI",5,2010,8210524086,1049412]
[null,null,null,null,null,null,null,null,null,null,null,null,null,"BUCARAMANGA","SI",5,2010,358089750,71930]
[null,null,null,null,null,null,null,null,null,null,null,null,null,"BUENAVENTURA",{"$error":"#N/A"},5,2010,76831379,17028]
[null,null,null,null,null,null,null,null,null,null,null,null,null,"BUGA",{"$error":"#N/A"},5,2010,6732000,1817]
[null,null,null,null,null,null,null,null,null,null,null,null,null,"CALI","SI",5,2010,1717689750,223753]
[null,null,null,null,null,null,null,null,null,null,null,null,null,"CARTAGENA","SI",5,2010,430944350,71363]
[null,null,null,null,null,null,null,null,null,null,null,null,null,"CARTAGO",{"$error":"#N/A"},5,2010,54759600,8037]
[null,null,null,null,null,null,null,null,null,null,null,null,null,"CAUCASIA",{"$error":"#N/A"},5,2010,12420000,2487]
[null,null,null,null,null,null,null,null,null,null,null,null,null,"CHIA",{"$error":"#N/A"},5,2010,59778500,6764]
[null,null,null,null,null,null,null,null,null,null,null,null,null,"CUCUTA","SI",5,2010,414272450,68865]
[null,null,null,null,null,null,null,null,null,null,null,null,null,"DUITAMA",{"$error":"#N/A"},5,2010,10142000,2174]
[null,null,null,null,null,null,null,null,null,null,null,null,null,"ENVIGADO",{"$error":"#N/A"},5,2010,702000,117]
[null,null,null,null,null,null,null,null,null,null,null,null,null,"FACATATIVA",{"$error":"#N/A"},5,2010,29760000,5952]
[null,null,null,null,null,null,null,null,null,null,null,null,null,"FLORENCIA",{"$error":"#N/A"},5,2010,14444500,2478]
[null,null,null,null,null,null,null,null,null,null,null,null,null,"FLORIDABLANCA","SI",5,2010,335260250,43545]
[null,null,null,null,null,null,null,null,null,null,null,null,null,"FUSAGASUGA",{"$error":"#N/A"},5,2010,3483000,875]
[null,null,null,null,null,null,null,null,null,null,null,null,null,"GIRARDOT",{"$error":"#N/A"},5,2010,3378000,1126]
[null,null,null,null,null,null,null,null,null,null,null,null,null,"IBAGUE","SI",5,2010,247015250,34964]
[null,null,null,null,null,null,null,null,null,null,null,null,null,"MANIZALES","SI",5,2010,217396150,29915]
[null,null,null,null,null,null,null,null,null,null,null,null,null,"MEDELLIN","SI",5,2010,2070148550,250106]
[null,null,null,null,null,null,null,null,null,null,null,null,null,"MELGAR",{"$error":"#N/A"},5,2010,1398000,358]
[null,null,null,null,null,null,null,null,null,null,null,null,null,"MONTERIA",{"$error":"#N/A"},5,2010,135547800,15005]
[null,null,null,null,null,null,null,null,null,null,null,null,null,"NEIVA","SI",5,2010,182687000,28014]
[null,null,null,null,null,null,null,null,null,null,null,null,null,"OCAQA",{"$error":"#N/A"},5,2010,4710000,785]
[null,null,null,null,null,null,null,null,null,null,null,null,null,"PALMIRA",{"$error":"#N/A"},5,2010,134351000,22664]
[null,null,null,null,null,null,null,null,null,null,null,null,null,"PASTO",{"$error":"#N/A"},5,2010,61692000,14797]
[null,null,null,null,null,null,null,null,null,null,null,null,null,"PEREIRA","SI",5,2010,330552750,49313]
[null,null,null,null,null,null,null,null,null,null,null,null,null,"PITALITO",{"$error":"#N/A"},5,2010,19144800,3442]
[null,null,null,null,null,null,null,null,null,null,null,null,null,"POPAYAN",{"$error":"#N/A"},5,2010,79052000,13830]
[null,null,null,null,null,null,null,null,null,null,null,null,null,"SAN ANDRES",{"$error":"#N/A"},5,2010,27790000,3738]
[null,null,null,null,null,null,null,null,null,null,null,null,null,"SANTA MARTA","SI",5,2010,217872500,36958]
[null,null,null,null,null,null,null,null,null,null,null,null,null,"SINCELEJO",{"$error":"#N/A"},5,2010,71739000,19334]
[null,null,null,null,null,null,null,null,null,null,null,null,null,"SOGAMOSO",{"$error":"#N/A"},5,2010,1667000,313]
[null,null,null,null,null,null,null,null,null,null,null,null,null,"TULUA",{"$error":"#N/A"},5,2010,63705000,16747]
[null,null,null,null,null,null,null,null,null,null,null,null,null,"TUNJA",{"$error":"#N/A"},5,2010,99946500,17858]
[null,null,null,null,null,null,null,null,null,null,null,null,null,"VALLEDUPAR","SI",5,2010,116024250,21030]
[null,null,null,null,null,null,null,null,null,null,null,null,null,"VILLAVICENCIO","SI",5,2010,284980000,59229]
[null,null,null,null,null,null,null,null,null,null,null,null,null,"YOPAL",{"$error":"#N/A"},5,2010,4736500,1069]
[null,null,null,null,null,null,null,null,null,null,null,null,null,"ZIPAQUIRA",{"$error":"#N/A"},5,2010,29895000,5979]
[null,null,null,null,null,null,null,null,null,null,null,null,null,"APARTADO",{"$error":"#N/A"},6,2010,47038500,8039]
[null,null,null,null,null,null,null,null,null,null,null,null,null,"ARMENIA",{"$error":"#N/A"},6,2010,250565950,29537]
[null,null,null,null,null,null,null,null,null,null,null,null,null,"BARRANQUILLA","SI",6,2010,1154280900,149779]
[null,null,null,null,null,null,null,null,null,null,null,null,null,"BELLO",{"$error":"#N/A"},6,2010,171029800,25820]
[null,null,null,null,null,null,null,null,null,null,null,null,null,"BOGOTA","SI",6,2010,12521999095,1526803]
[null,null,null,null,null,null,null,null,null,null,null,null,null,"BUCARAMANGA","SI",6,2010,512847000,107011]
[null,null,null,null,null,null,null,null,null,null,null,null,null,"BUENAVENTURA",{"$error":"#N/A"},6,2010,78585625,16800]
[null,null,null,null,null,null,null,null,null,null,null,null,null,"BUGA",{"$error":"#N/A"},6,2010,6299000,1688]
[null,null,null,null,null,null,null,null,null,null,null,null,null,"CALI","SI",6,2010,2304979550,292291]
[null,null,null,null,null,null,null,null,null,null,null,null,null,"CARTAGENA","SI",6,2010,579051050,91924]
[null,null,null,null,null,null,null,null,null,null,null,null,null,"CARTAGO",{"$error":"#N/A"},6,2010,63478800,9324]
[null,null,null,null,null,null,null,null,null,null,null,null,null,"CAUCASIA",{"$error":"#N/A"},6,2010,14145000,2829]
[null,null,null,null,null,null,null,null,null,null,null,null,null,"CHIA",{"$error":"#N/A"},6,2010,298758450,29483]
[null,null,null,null,null,null,null,null,null,null,null,null,null,"CUCUTA","SI",6,2010,570431850,92665]
[null,null,null,null,null,null,null,null,null,null,null,null,null,"DUITAMA",{"$error":"#N/A"},6,2010,17634000,4116]
[null,null,null,null,null,null,null,null,null,null,null,null,null,"ENVIGADO",{"$error":"#N/A"},6,2010,198000,33]
[null,null,null,null,null,null,null,null,null,null,null,null,null,"FACATATIVA",{"$error":"#N/A"},6,2010,38720000,7744]
[null,null,null,null,null,null,null,null,null,null,null,null,null,"FLORENCIA",{"$error":"#N/A"},6,2010,25576808,4347]
[null,null,null,null,null,null,null,null,null,null,null,null,null,"FLORIDABLANCA","SI",6,2010,471396500,65283]
[null,null,null,null,null,null,null,null,null,null,null,null,null,"FUSAGASUGA",{"$error":"#N/A"},6,2010,10879500,2926]
[null,null,null,null,null,null,null,null,null,null,null,null,null,"GIRARDOT",{"$error":"#N/A"},6,2010,12261000,4087]
[null,null,null,null,null,null,null,null,null,null,null,null,null,"IBAGUE","SI",6,2010,397876150,51055]
[null,null,null,null,null,null,null,null,null,null,null,null,null,"MANIZALES","SI",6,2010,285594600,39314]
[null,null,null,null,null,null,null,null,null,null,null,null,null,"MEDELLIN",{"$f":"+VLOOKUP(N1731,$U$2:$V$16,2,FALSE)","v":"SI"},6,2010,3068777000,364009]
[null,null,null,null,null,null,null,null,null,null,null,null,null,"MELGAR",{"$error":"#N/A"},6,2010,6474000,1390]
[null,null,null,null,null,null,null,null,null,null,null,null,null,"MONTERIA",{"$error":"#N/A"},6,2010,193712100,22890]
[null,null,null,null,null,null,null,null,null,null,null,null,null,"NEIVA","SI",6,2010,236837000,37534]
[null,null,null,null,null,null,null,null,null,null,null,null,null,"OCAQA",{"$error":"#N/A"},6,2010,60000,10]
[null,null,null,null,null,null,null,null,null,null,null,null,null,"PALMIRA",{"$error":"#N/A"},6,2010,150175000,25605]
[null,null,null,null,null,null,null,null,null,null,null,null,null,"PASTO",{"$error":"#N/A"},6,2010,98071000,22043]
[null,null,null,null,null,null,null,null,null,null,null,null,null,"PEREIRA","SI",6,2010,476178150,68436]
[null,null,null,null,null,null,null,null,null,null,null,null,null,"PITALITO",{"$error":"#N/A"},6,2010,29016000,5955]
[null,null,null,null,null,null,null,null,null,null,null,null,null,"POPAYAN",{"$error":"#N/A"},6,2010,119039000,20709]
[null,null,null,null,null,null,null,null,null,null,null,null,null,"SAN ANDRES",{"$error":"#N/A"},6,2010,36694000,4936]
[null,null,null,null,null,null,null,null,null,null,null,null,null,"SANTA MARTA","SI",6,2010,262292500,44563]
[null,null,null,null,null,null,null,null,null,null,null,null,null,"SINCELEJO",{"$error":"#N/A"},6,2010,104509000,25672]
[null,null,null,null,null,null,null,null,null,null,null,null,null,"SOGAMOSO",{"$error":"#N/A"},6,2010,2102000,369]
[null,null,null,null,null,null,null,null,null,null,null,null,null,"TULUA",{"$error":"#N/A"},6,2010,87254000,21052]
[null,null,null,null,null,null,null,null,null,null,null,null,null,"TUNJA",{"$error":"#N/A"},6,2010,140371750,25891]
[null,null,null,null,null,null,null,null,null,null,null,null,null,"VALLEDUPAR","SI",6,2010,154619750,28351]
[null,null,null,null,null,null,null,null,null,null,null,null,null,"VILLAVICENCIO","SI",6,2010,409672300,77427]
[null,null,null,null,null,null,null,null,null,null,null,null,null,"YOPAL",{"$error":"#N/A"},6,2010,25973000,4437]
[null,null,null,null,null,null,null,null,null,null,null,null,null,"ZIPAQUIRA",{"$error":"#N/A"},6,2010,42210000,8442]
[null,null,null,null,null,null,null,null,null,null,null,null,null,"APARTADO",{"$error":"#N/A"},7,2010,61696000,10162]
[null,null,null,null,null,null,null,null,null,null,null,null,null,"ARMENIA",{"$error":"#N/A"},7,2010,346275200,37579]
[null,null,null,null,null,null,null,null,null,null,null,null,null,"BARRANQUILLA","SI",7,2010,1513419150,196067]
[null,null,null,null,null,null,null,null,null,null,null,null,null,"BELLO",{"$error":"#N/A"},7,2010,238216300,30576]
[null,null,null,null,null,null,null,null,null,null,null,null,null,"BOGOTA","SI",7,2010,15749182432,1851807]
[null,null,null,null,null,null,null,null,null,null,null,null,null,"BUCARAMANGA","SI",7,2010,658658000,128295]
[null,null,null,null,null,null,null,null,null,null,null,null,null,"BUENAVENTURA",{"$error":"#N/A"},7,2010,105001375,21907]
[null,null,null,null,null,null,null,null,null,null,null,null,null,"BUGA",{"$error":"#N/A"},7,2010,11467500,2967]
[null,null,null,null,null,null,null,null,null,null,null,null,null,"CALI","SI",7,2010,3577218450,456165]
[null,null,null,null,null,null,null,null,null,null,null,null,null,"CARTAGENA","SI",7,2010,738583950,114122]
[null,null,null,null,null,null,null,null,null,null,null,null,null,"CARTAGO",{"$error":"#N/A"},7,2010,96605400,14197]
[null,null,null,null,null,null,null,null,null,null,null,null,null,"CAUCASIA",{"$error":"#N/A"},7,2010,14605000,2921]
[null,null,null,null,null,null,null,null,null,null,null,null,null,"CHIA",{"$error":"#N/A"},7,2010,527776350,50829]
[null,null,null,null,null,null,null,null,null,null,null,null,null,"CUCUTA","SI",7,2010,799049250,114622]
[null,null,null,null,null,null,null,null,null,null,null,null,null,"DUITAMA",{"$error":"#N/A"},7,2010,22056000,5189]
[null,null,null,null,null,null,null,null,null,null,null,null,null,"ENVIGADO",{"$error":"#N/A"},7,2010,522000,87]
[null,null,null,null,null,null,null,null,null,null,null,null,null,"FACATATIVA",{"$error":"#N/A"},7,2010,34480000,6896]
[null,null,null,null,null,null,null,null,null,null,null,null,null,"FLORENCIA",{"$error":"#N/A"},7,2010,18796000,3142]
[null,null,null,null,null,null,null,null,null,null,null,null,null,"FLORIDABLANCA","SI",7,2010,656365500,81514]
[null,null,null,null,null,null,null,null,null,null,null,null,null,"FUSAGASUGA",{"$error":"#N/A"},7,2010,6267000,1679]
[null,null,null,null,null,null,null,null,null,null,null,null,null,"GIRARDOT",{"$error":"#N/A"},7,2010,10383000,3461]
[null,null,null,null,null,null,null,null,null,null,null,null,null,"IBAGUE","SI",7,2010,487962200,63999]
[null,null,null,null,null,null,null,null,null,null,null,null,null,"MANIZALES","SI",7,2010,396068700,54659]
[null,null,null,null,null,null,null,null,null,null,null,null,null,"MEDELLIN","SI",7,2010,3863959050,437282]
[null,null,null,null,null,null,null,null,null,null,null,null,null,"MELGAR",{"$error":"#N/A"},7,2010,5973500,1314]
[null,null,null,null,null,null,null,null,null,null,null,null,null,"MONTERIA",{"$error":"#N/A"},7,2010,262512500,29403]
[null,null,null,null,null,null,null,null,null,null,null,null,null,"NEIVA","SI",7,2010,340221250,54346]
[null,null,null,null,null,null,null,null,null,null,null,null,null,"OCAQA",{"$error":"#N/A"},7,2010,3666000,611]
[null,null,null,null,null,null,null,null,null,null,null,null,null,"PALMIRA",{"$error":"#N/A"},7,2010,223728500,39079]
[null,null,null,null,null,null,null,null,null,null,null,null,null,"PASTO",{"$error":"#N/A"},7,2010,131052500,28222]
[null,null,null,null,null,null,null,null,null,null,null,null,null,"PEREIRA","SI",7,2010,749372250,90760]
[null,null,null,null,null,null,null,null,null,null,null,null,null,"PITALITO",{"$error":"#N/A"},7,2010,28476000,5728]
[null,null,null,null,null,null,null,null,null,null,null,null,null,"POPAYAN",{"$error":"#N/A"},7,2010,225886000,31736]
[null,null,null,null,null,null,null,null,null,null,null,null,null,"RIONEGRO",{"$error":"#N/A"},7,2010,55285500,8348]
[null,null,null,null,null,null,null,null,null,null,null,null,null,"SAN ANDRES",{"$error":"#N/A"},7,2010,45263000,5987]
[null,null,null,null,null,null,null,null,null,null,null,null,null,"SANTA MARTA","SI",7,2010,367899500,62501]
[null,null,null,null,null,null,null,null,null,null,null,null,null,"SINCELEJO",{"$error":"#N/A"},7,2010,151136000,32400]
[null,null,null,null,null,null,null,null,null,null,null,null,null,"SOGAMOSO",{"$error":"#N/A"},7,2010,4708000,905]
[null,null,null,null,null,null,null,null,null,null,null,null,null,"TULUA",{"$error":"#N/A"},7,2010,123502000,26188]
[null,null,null,null,null,null,null,null,null,null,null,null,null,"TUNJA",{"$error":"#N/A"},7,2010,184420250,34179]
[null,null,null,null,null,null,null,null,null,null,null,null,null,"VALLEDUPAR","SI",7,2010,238135750,44174]
[null,null,null,null,null,null,null,null,null,null,null,null,null,"VILLAVICENCIO","SI",7,2010,590558500,94007]
[null,null,null,null,null,null,null,null,null,null,null,null,null,"YOPAL",{"$error":"#N/A"},7,2010,32789000,5614]
[null,null,null,null,null,null,null,null,null,null,null,null,null,"ZIPAQUIRA",{"$error":"#N/A"},7,2010,50755000,10151]
[null,null,null,null,null,null,null,null,null,null,null,null,null,"APARTADO",{"$f":"+VLOOKUP(N1795,$U$2:$V$16,2,FALSE)","v":{"$error":"#N/A"}},8,2010,38535500,6481]
[null,null,null,null,null,null,null,null,null,null,null,null,null,"ARMENIA",{"$error":"#N/A"},8,2010,172598600,19845]
[null,null,null,null,null,null,null,null,null,null,null,null,null,"BARRANQUILLA","SI",8,2010,983397300,127823]
[null,null,null,null,null,null,null,null,null,null,null,null,null,"BELLO",{"$error":"#N/A"},8,2010,184614200,21757]
[null,null,null,null,null,null,null,null,null,null,null,null,null,"BOGOTA","SI",8,2010,9776108496,1170074]
[null,null,null,null,null,null,null,null,null,null,null,null,null,"BUCARAMANGA","SI",8,2010,474396500,86325]
[null,null,null,null,null,null,null,null,null,null,null,null,null,"BUENAVENTURA",{"$error":"#N/A"},8,2010,82040750,17384]
[null,null,null,null,null,null,null,null,null,null,null,null,null,"BUGA",{"$error":"#N/A"},8,2010,10877000,2867]
[null,null,null,null,null,null,null,null,null,null,null,null,null,"CALI","SI",8,2010,2406470200,314437]
[null,null,null,null,null,null,null,null,null,null,null,null,null,"CARTAGENA","SI",8,2010,459846550,71323]
[null,null,null,null,null,null,null,null,null,null,null,null,null,"CARTAGO",{"$error":"#N/A"},8,2010,57449100,8479]
[null,null,null,null,null,null,null,null,null,null,null,null,null,"CAUCASIA",{"$error":"#N/A"},8,2010,8170000,1634]
[null,null,null,null,null,null,null,null,null,null,null,null,null,"CHIA",{"$error":"#N/A"},8,2010,324271350,32066]
[null,null,null,null,null,null,null,null,null,null,null,null,null,"CUCUTA","SI",8,2010,548430250,77374]
[null,null,null,null,null,null,null,null,null,null,null,null,null,"DUITAMA",{"$error":"#N/A"},8,2010,7482000,1733]
[null,null,null,null,null,null,null,null,null,null,null,null,null,"ENVIGADO",{"$error":"#N/A"},8,2010,234000,39]
[null,null,null,null,null,null,null,null,null,null,null,null,null,"FACATATIVA",{"$error":"#N/A"},8,2010,26635000,5327]
[null,null,null,null,null,null,null,null,null,null,null,null,null,"FLORENCIA",{"$error":"#N/A"},8,2010,22023500,3711]
[null,null,null,null,null,null,null,null,null,null,null,null,null,"FLORIDABLANCA","SI",8,2010,402943250,51854]
[null,null,null,null,null,null,null,null,null,null,null,null,null,"FUSAGASUGA",{"$error":"#N/A"},8,2010,3427000,855]
[null,null,null,null,null,null,null,null,null,null,null,null,null,"GIRARDOT",{"$error":"#N/A"},8,2010,7704000,1926]
[null,null,null,null,null,null,null,null,null,null,null,null,null,"IBAGUE","SI",8,2010,286076850,39010]
[null,null,null,null,null,null,null,null,null,null,null,null,null,"MANIZALES","SI",8,2010,217579250,31753]
[null,null,null,null,null,null,null,null,null,null,null,null,null,"MEDELLIN","SI",8,2010,2531367250,295068]
[null,null,null,null,null,null,null,null,null,null,null,null,null,"MELGAR",{"$error":"#N/A"},8,2010,3652500,884]
[null,null,null,null,null,null,null,null,null,null,null,null,null,"MONTERIA",{"$error":"#N/A"},8,2010,145106550,16365]
[null,null,null,null,null,null,null,null,null,null,null,null,null,"NEIVA","SI",8,2010,218362000,35243]
[null,null,null,null,null,null,null,null,null,null,null,null,null,"OCAQA",{"$error":"#N/A"},8,2010,864000,144]
[null,null,null,null,null,null,null,null,null,null,null,null,null,"PALMIRA",{"$error":"#N/A"},8,2010,141469500,24630]
[null,null,null,null,null,null,null,null,null,null,null,null,null,"PASTO",{"$error":"#N/A"},8,2010,119659000,18320]
[null,null,null,null,null,null,null,null,null,null,null,null,null,"PEREIRA","SI",8,2010,411851450,52156]
[null,null,null,null,null,null,null,null,null,null,null,null,null,"PITALITO",{"$error":"#N/A"},8,2010,22278000,4632]
[null,null,null,null,null,null,null,null,null,null,null,null,null,"POPAYAN",{"$error":"#N/A"},8,2010,144434000,18875]
[null,null,null,null,null,null,null,null,null,null,null,null,null,"RIONEGRO",{"$error":"#N/A"},8,2010,196318000,30139]
[null,null,null,null,null,null,null,null,null,null,null,null,null,"SAN ANDRES",{"$error":"#N/A"},8,2010,28756000,3839]
[null,null,null,null,null,null,null,null,null,null,null,null,null,"SANTA MARTA","SI",8,2010,221599500,37478]
[null,null,null,null,null,null,null,null,null,null,null,null,null,"SINCELEJO",{"$error":"#N/A"},8,2010,86843300,18371]
[null,null,null,null,null,null,null,null,null,null,null,null,null,"SOGAMOSO",{"$error":"#N/A"},8,2010,1473000,259]
[null,null,null,null,null,null,null,null,null,null,null,null,null,"TULUA",{"$error":"#N/A"},8,2010,95709000,20203]
[null,null,null,null,null,null,null,null,null,null,null,null,null,"TUNJA",{"$error":"#N/A"},8,2010,110263000,20043]
[null,null,null,null,null,null,null,null,null,null,null,null,null,"VALLEDUPAR","SI",8,2010,145358250,26896]
[null,null,null,null,null,null,null,null,null,null,null,null,null,"VILLAVICENCIO","SI",8,2010,389510000,64001]
[null,null,null,null,null,null,null,null,null,null,null,null,null,"YOPAL",{"$error":"#N/A"},8,2010,22315000,3770]
[null,null,null,null,null,null,null,null,null,null,null,null,null,"ZIPAQUIRA",{"$error":"#N/A"},8,2010,32540000,6508]
[null,null,null,null,null,null,null,null,null,null,null,null,null,"APARTADO",{"$error":"#N/A"},9,2010,25610000,4337]
[null,null,null,null,null,null,null,null,null,null,null,null,null,"ARMENIA",{"$error":"#N/A"},9,2010,149205700,17640]
[null,null,null,null,null,null,null,null,null,null,null,null,null,"BARRANQUILLA","SI",9,2010,690824500,87672]
[null,null,null,null,null,null,null,null,null,null,null,null,null,"BELLO",{"$error":"#N/A"},9,2010,175913000,19639]
[null,null,null,null,null,null,null,null,null,null,null,null,null,"BOGOTA","SI",9,2010,7435616543,880653]
[null,null,null,null,null,null,null,null,null,null,null,null,null,"BUCARAMANGA","SI",9,2010,367968750,64510]
[null,null,null,null,null,null,null,null,null,null,null,null,null,"BUENAVENTURA",{"$error":"#N/A"},9,2010,54272740,12487]
[null,null,null,null,null,null,null,null,null,null,null,null,null,"BUGA",{"$error":"#N/A"},9,2010,7323000,1945]
[null,null,null,null,null,null,null,null,null,null,null,null,null,"CALI","SI",9,2010,1788761750,233346]
[null,null,null,null,null,null,null,null,null,null,null,null,null,"CARTAGENA","SI",9,2010,367420300,57618]
[null,null,null,null,null,null,null,null,null,null,null,null,null,"CARTAGO",{"$error":"#N/A"},9,2010,40017100,6086]
[null,null,null,null,null,null,null,null,null,null,null,null,null,"CHIA",{"$error":"#N/A"},9,2010,240275100,24617]
[null,null,null,null,null,null,null,null,null,null,null,null,null,"CUCUTA","SI",9,2010,420630000,58899]
[null,null,null,null,null,null,null,null,null,null,null,null,null,"DUITAMA",{"$error":"#N/A"},9,2010,4686000,1080]
[null,null,null,null,null,null,null,null,null,null,null,null,null,"ENVIGADO",{"$error":"#N/A"},9,2010,840000,140]
[null,null,null,null,null,null,null,null,null,null,null,null,null,"FACATATIVA",{"$error":"#N/A"},9,2010,15309000,3142]
[null,null,null,null,null,null,null,null,null,null,null,null,null,"FLORENCIA",{"$error":"#N/A"},9,2010,11166500,1883]
[null,null,null,null,null,null,null,null,null,null,null,null,null,"FLORIDABLANCA","SI",9,2010,320297500,42460]
[null,null,null,null,null,null,null,null,null,null,null,null,null,"FUSAGASUGA",{"$error":"#N/A"},9,2010,2151000,550]
[null,null,null,null,null,null,null,null,null,null,null,null,null,"GIRARDOT",{"$error":"#N/A"},9,2010,7672000,1918]
[null,null,null,null,null,null,null,null,null,null,null,null,null,"IBAGUE",{"$f":"+VLOOKUP(N1859,$U$2:$V$16,2,FALSE)","v":"SI"},9,2010,243289750,33514]
[null,null,null,null,null,null,null,null,null,null,null,null,null,"MANIZALES","SI",9,2010,176560200,25012]
[null,null,null,null,null,null,null,null,null,null,null,null,null,"MEDELLIN","SI",9,2010,1965421550,223736]
[null,null,null,null,null,null,null,null,null,null,null,null,null,"MELGAR",{"$error":"#N/A"},9,2010,1555000,374]
[null,null,null,null,null,null,null,null,null,null,null,null,null,"MONTERIA",{"$error":"#N/A"},9,2010,125770300,16222]
[null,null,null,null,null,null,null,null,null,null,null,null,null,"NEIVA","SI",9,2010,194366000,34275]
[null,null,null,null,null,null,null,null,null,null,null,null,null,"OCAQA",{"$error":"#N/A"},9,2010,414000,69]
[null,null,null,null,null,null,null,null,null,null,null,null,null,"PALMIRA",{"$error":"#N/A"},9,2010,100342500,17875]
[null,null,null,null,null,null,null,null,null,null,null,null,null,"PASTO",{"$error":"#N/A"},9,2010,103740000,14499]
[null,null,null,null,null,null,null,null,null,null,null,null,null,"PEREIRA","SI",9,2010,402776500,47833]
[null,null,null,null,null,null,null,null,null,null,null,null,null,"PITALITO",{"$error":"#N/A"},9,2010,17164000,3564]
[null,null,null,null,null,null,null,null,null,null,null,null,null,"POPAYAN",{"$error":"#N/A"},9,2010,113935500,13538]
[null,null,null,null,null,null,null,null,null,null,null,null,null,"RIONEGRO",{"$error":"#N/A"},9,2010,117040500,18380]
[null,null,null,null,null,null,null,null,null,null,null,null,null,"SAN ANDRES",{"$error":"#N/A"},9,2010,19154000,2497]
[null,null,null,null,null,null,null,null,null,null,null,null,null,"SANTA MARTA","SI",9,2010,159480000,27546]
[null,null,null,null,null,null,null,null,null,null,null,null,null,"SINCELEJO",{"$error":"#N/A"},9,2010,62433650,13335]
[null,null,null,null,null,null,null,null,null,null,null,null,null,"SOGAMOSO",{"$error":"#N/A"},9,2010,447000,75]
[null,null,null,null,null,null,null,null,null,null,null,null,null,"TULUA",{"$error":"#N/A"},9,2010,53811000,11417]
[null,null,null,null,null,null,null,null,null,null,null,null,null,"TUNJA",{"$error":"#N/A"},9,2010,87081750,16237]
[null,null,null,null,null,null,null,null,null,null,null,null,null,"VALLEDUPAR","SI",9,2010,99740750,18658]
[null,null,null,null,null,null,null,null,null,null,null,null,null,"VILLAVICENCIO","SI",9,2010,336217000,52475]
[null,null,null,null,null,null,null,null,null,null,null,null,null,"YOPAL",{"$error":"#N/A"},9,2010,15693500,2714]
[null,null,null,null,null,null,null,null,null,null,null,null,null,"ZIPAQUIRA",{"$error":"#N/A"},9,2010,23641000,4925]
[null,null,null,null,null,null,null,null,null,null,null,null,null,"APARTADO",{"$error":"#N/A"},10,2010,35199000,5995]
[null,null,null,null,null,null,null,null,null,null,null,null,null,"ARMENIA",{"$error":"#N/A"},10,2010,121350150,13435]
[null,null,null,null,null,null,null,null,null,null,null,null,null,"BARRANQUILLA","SI",10,2010,797474550,102709]
[null,null,null,null,null,null,null,null,null,null,null,null,null,"BELLO",{"$error":"#N/A"},10,2010,176808400,20328]
[null,null,null,null,null,null,null,null,null,null,null,null,null,"BOGOTA","SI",10,2010,8775606900,1041585]
[null,null,null,null,null,null,null,null,null,null,null,null,null,"BUCARAMANGA","SI",10,2010,388569000,62081]
[null,null,null,null,null,null,null,null,null,null,null,null,null,"BUENAVENTURA",{"$error":"#N/A"},10,2010,61793680,14431]
[null,null,null,null,null,null,null,null,null,null,null,null,null,"BUGA",{"$error":"#N/A"},10,2010,9096500,2438]
[null,null,null,null,null,null,null,null,null,null,null,null,null,"CALI","SI",10,2010,1902162150,245073]
[null,null,null,null,null,null,null,null,null,null,null,null,null,"CARTAGENA","SI",10,2010,383981950,60038]
[null,null,null,null,null,null,null,null,null,null,null,null,null,"CARTAGO",{"$error":"#N/A"},10,2010,38347200,5670]
[null,null,null,null,null,null,null,null,null,null,null,null,null,"CHIA",{"$error":"#N/A"},10,2010,283638300,29815]
[null,null,null,null,null,null,null,null,null,null,null,null,null,"CUCUTA","SI",10,2010,411544000,57752]
[null,null,null,null,null,null,null,null,null,null,null,null,null,"DUITAMA",{"$error":"#N/A"},10,2010,5234000,1217]
[null,null,null,null,null,null,null,null,null,null,null,null,null,"ENVIGADO",{"$error":"#N/A"},10,2010,558000,93]
[null,null,null,null,null,null,null,null,null,null,null,null,null,"FACATATIVA",{"$error":"#N/A"},10,2010,16753000,3459]
[null,null,null,null,null,null,null,null,null,null,null,null,null,"FLORENCIA",{"$error":"#N/A"},10,2010,15338500,2541]
[null,null,null,null,null,null,null,null,null,null,null,null,null,"FLORIDABLANCA","SI",10,2010,331692750,41571]
[null,null,null,null,null,null,null,null,null,null,null,null,null,"FUSAGASUGA",{"$error":"#N/A"},10,2010,3396000,893]
[null,null,null,null,null,null,null,null,null,null,null,null,null,"GIRARDOT",{"$error":"#N/A"},10,2010,3856000,964]
[null,null,null,null,null,null,null,null,null,null,null,null,null,"IBAGUE","SI",10,2010,249737850,30927]
[null,null,null,null,null,null,null,null,null,null,null,null,null,"MANIZALES","SI",10,2010,198521000,25629]
[null,null,null,null,null,null,null,null,null,null,null,null,null,"MEDELLIN","SI",10,2010,2212255750,255487]
[null,null,null,null,null,null,null,null,null,null,null,null,null,"MELGAR",{"$error":"#N/A"},10,2010,2294000,513]
[null,null,null,null,null,null,null,null,null,null,null,null,null,"MONTERIA",{"$error":"#N/A"},10,2010,131478250,14563]
[null,null,null,null,null,null,null,null,null,null,null,null,null,"NEIVA","SI",10,2010,169296750,28430]
[null,null,null,null,null,null,null,null,null,null,null,null,null,"PALMIRA",{"$error":"#N/A"},10,2010,101130250,17514]
[null,null,null,null,null,null,null,null,null,null,null,null,null,"PASTO",{"$error":"#N/A"},10,2010,92050000,13470]
[null,null,null,null,null,null,null,null,null,null,null,null,null,"PEREIRA","SI",10,2010,345664750,41192]
[null,null,null,null,null,null,null,null,null,null,null,null,null,"PITALITO",{"$error":"#N/A"},10,2010,21847500,4520]
[null,null,null,null,null,null,null,null,null,null,null,null,null,"POPAYAN",{"$error":"#N/A"},10,2010,110455000,14070]
[null,null,null,null,null,null,null,null,null,null,null,null,null,"RIONEGRO",{"$error":"#N/A"},10,2010,109921500,17525]
[null,null,null,null,null,null,null,null,null,null,null,null,null,"SAN ANDRES",{"$error":"#N/A"},10,2010,19555000,2595]
[null,null,null,null,null,null,null,null,null,null,null,null,null,"SANTA MARTA","SI",10,2010,151003750,25791]
[null,null,null,null,null,null,null,null,null,null,null,null,null,"SINCELEJO",{"$error":"#N/A"},10,2010,74328650,15859]
[null,null,null,null,null,null,null,null,null,null,null,null,null,"SOGAMOSO",{"$error":"#N/A"},10,2010,1414000,240]
[null,null,null,null,null,null,null,null,null,null,null,null,null,"TULUA",{"$error":"#N/A"},10,2010,51058000,10727]
[null,null,null,null,null,null,null,null,null,null,null,null,null,"TUNJA",{"$error":"#N/A"},10,2010,78942250,14232]
[null,null,null,null,null,null,null,null,null,null,null,null,null,"VALLEDUPAR","SI",10,2010,97529750,18242]
[null,null,null,null,null,null,null,null,null,null,null,null,null,"VILLAVICENCIO","SI",10,2010,346711000,57465]
[null,null,null,null,null,null,null,null,null,null,null,null,null,"YOPAL",{"$error":"#N/A"},10,2010,17374000,3021]
[null,null,null,null,null,null,null,null,null,null,null,null,null,"ZIPAQUIRA",{"$f":"+VLOOKUP(N1923,$U$2:$V$16,2,FALSE)","v":{"$error":"#N/A"}},10,2010,22492000,4661]
[null,null,null,null,null,null,null,null,null,null,null,null,null,"APARTADO",{"$error":"#N/A"},11,2010,37164000,6487]
[null,null,null,null,null,null,null,null,null,null,null,null,null,"ARMENIA",{"$error":"#N/A"},11,2010,168911350,20772]
[null,null,null,null,null,null,null,null,null,null,null,null,null,"BARRANQUILLA","SI",11,2010,916534800,120213]
[null,null,null,null,null,null,null,null,null,null,null,null,null,"BELLO",{"$error":"#N/A"},11,2010,188290100,21962]
[null,null,null,null,null,null,null,null,null,null,null,null,null,"BOGOTA","SI",11,2010,9064826350,1107400]
[null,null,null,null,null,null,null,null,null,null,null,null,null,"BUCARAMANGA","SI",11,2010,451711400,74524]
[null,null,null,null,null,null,null,null,null,null,null,null,null,"BUENAVENTURA",{"$error":"#N/A"},11,2010,54409486,12579]
[null,null,null,null,null,null,null,null,null,null,null,null,null,"BUGA",{"$error":"#N/A"},11,2010,6734000,1770]
[null,null,null,null,null,null,null,null,null,null,null,null,null,"CALI","SI",11,2010,1926595400,251470]
[null,null,null,null,null,null,null,null,null,null,null,null,null,"CARTAGENA","SI",11,2010,486458450,76731]
[null,null,null,null,null,null,null,null,null,null,null,null,null,"CARTAGO",{"$error":"#N/A"},11,2010,38862400,5704]
[null,null,null,null,null,null,null,null,null,null,null,null,null,"CHIA",{"$error":"#N/A"},11,2010,270553000,28934]
[null,null,null,null,null,null,null,null,null,null,null,null,null,"CUCUTA","SI",11,2010,430483550,60780]
[null,null,null,null,null,null,null,null,null,null,null,null,null,"DUITAMA",{"$error":"#N/A"},11,2010,9776000,2263]
[null,null,null,null,null,null,null,null,null,null,null,null,null,"ENVIGADO",{"$error":"#N/A"},11,2010,570000,95]
[null,null,null,null,null,null,null,null,null,null,null,null,null,"FACATATIVA",{"$error":"#N/A"},11,2010,17475000,3495]
[null,null,null,null,null,null,null,null,null,null,null,null,null,"FLORENCIA",{"$error":"#N/A"},11,2010,14099000,2355]
[null,null,null,null,null,null,null,null,null,null,null,null,null,"FLORIDABLANCA","SI",11,2010,361390500,49302]
[null,null,null,null,null,null,null,null,null,null,null,null,null,"FUSAGASUGA",{"$error":"#N/A"},11,2010,5368500,1370]
[null,null,null,null,null,null,null,null,null,null,null,null,null,"GIRARDOT",{"$error":"#N/A"},11,2010,7856000,1964]
[null,null,null,null,null,null,null,null,null,null,null,null,null,"IBAGUE","SI",11,2010,254908100,35828]
[null,null,null,null,null,null,null,null,null,null,null,null,null,"MANIZALES","SI",11,2010,340874550,50657]
[null,null,null,null,null,null,null,null,null,null,null,null,null,"MEDELLIN","SI",11,2010,2299733450,274169]
[null,null,null,null,null,null,null,null,null,null,null,null,null,"MELGAR",{"$error":"#N/A"},11,2010,4276000,950]
[null,null,null,null,null,null,null,null,null,null,null,null,null,"MONTERIA",{"$error":"#N/A"},11,2010,136462500,15818]
[null,null,null,null,null,null,null,null,null,null,null,null,null,"NEIVA","SI",11,2010,178218750,30197]
[null,null,null,null,null,null,null,null,null,null,null,null,null,"PALMIRA",{"$error":"#N/A"},11,2010,103908000,18463]
[null,null,null,null,null,null,null,null,null,null,null,null,null,"PASTO",{"$error":"#N/A"},11,2010,101383000,14516]
[null,null,null,null,null,null,null,null,null,null,null,null,null,"PEREIRA","SI",11,2010,401506200,51283]
[null,null,null,null,null,null,null,null,null,null,null,null,null,"PITALITO",{"$error":"#N/A"},11,2010,18358000,3723]
[null,null,null,null,null,null,null,null,null,null,null,null,null,"POPAYAN",{"$error":"#N/A"},11,2010,124228000,17366]
[null,null,null,null,null,null,null,null,null,null,null,null,null,"RIONEGRO",{"$error":"#N/A"},11,2010,102719500,16524]
[null,null,null,null,null,null,null,null,null,null,null,null,null,"SAN ANDRES",{"$error":"#N/A"},11,2010,23128000,3138]
[null,null,null,null,null,null,null,null,null,null,null,null,null,"SANTA MARTA","SI",11,2010,192334500,32878]
[null,null,null,null,null,null,null,null,null,null,null,null,null,"SINCELEJO",{"$error":"#N/A"},11,2010,72034300,14865]
[null,null,null,null,null,null,null,null,null,null,null,null,null,"SOGAMOSO",{"$error":"#N/A"},11,2010,1188000,200]
[null,null,null,null,null,null,null,null,null,null,null,null,null,"TULUA",{"$error":"#N/A"},11,2010,61123000,12356]
[null,null,null,null,null,null,null,null,null,null,null,null,null,"TUNJA",{"$error":"#N/A"},11,2010,99518500,18512]
[null,null,null,null,null,null,null,null,null,null,null,null,null,"VALLEDUPAR","SI",11,2010,99668000,18967]
[null,null,null,null,null,null,null,null,null,null,null,null,null,"VILLAVICENCIO","SI",11,2010,359119000,62446]
[null,null,null,null,null,null,null,null,null,null,null,null,null,"YOPAL",{"$error":"#N/A"},11,2010,15748500,3030]
[null,null,null,null,null,null,null,null,null,null,null,null,null,"ZIPAQUIRA",{"$error":"#N/A"},11,2010,23600000,4720]
[null,null,null,null,null,null,null,null,null,null,null,null,null,"APARTADO",{"$error":"#N/A"},12,2010,46990000,8452]
[null,null,null,null,null,null,null,null,null,null,null,null,null,"ARMENIA",{"$error":"#N/A"},12,2010,222170750,27536]
[null,null,null,null,null,null,null,null,null,null,null,null,null,"BARRANCABERMEJA",{"$error":"#N/A"},12,2010,227308500,20450]
[null,null,null,null,null,null,null,null,null,null,null,null,null,"BARRANQUILLA","SI",12,2010,1014566750,126329]
[null,null,null,null,null,null,null,null,null,null,null,null,null,"BELLO",{"$error":"#N/A"},12,2010,217499900,25900]
[null,null,null,null,null,null,null,null,null,null,null,null,null,"BOGOTA","SI",12,2010,10544761416,1267093]
[null,null,null,null,null,null,null,null,null,null,null,null,null,"BUCARAMANGA","SI",12,2010,571700250,88915]
[null,null,null,null,null,null,null,null,null,null,null,null,null,"BUENAVENTURA",{"$error":"#N/A"},12,2010,73646214,14532]
[null,null,null,null,null,null,null,null,null,null,null,null,null,"BUGA",{"$error":"#N/A"},12,2010,7832000,1983]
[null,null,null,null,null,null,null,null,null,null,null,null,null,"CALI","SI",12,2010,1990508150,252342]
[null,null,null,null,null,null,null,null,null,null,null,null,null,"CARTAGENA","SI",12,2010,635752700,94254]
[null,null,null,null,null,null,null,null,null,null,null,null,null,"CARTAGO",{"$error":"#N/A"},12,2010,49774200,7274]
[null,null,null,null,null,null,null,null,null,null,null,null,null,"CHIA",{"$error":"#N/A"},12,2010,361262250,37121]
[null,null,null,null,null,null,null,null,null,null,null,null,null,"CUCUTA","SI",12,2010,583898250,77210]
[null,null,null,null,null,null,null,null,null,null,null,null,null,"DUITAMA",{"$error":"#N/A"},12,2010,11460000,2730]
[null,null,null,null,null,null,null,null,null,null,null,null,null,"ENVIGADO",{"$error":"#N/A"},12,2010,330000,55]
[null,null,null,null,null,null,null,null,null,null,null,null,null,"FACATATIVA",{"$error":"#N/A"},12,2010,23075000,4615]
[null,null,null,null,null,null,null,null,null,null,null,null,null,"FLORENCIA",{"$error":"#N/A"},12,2010,16526000,2756]
[null,null,null,null,null,null,null,null,null,null,null,null,null,"FLORIDABLANCA","SI",12,2010,459124000,59181]
[null,null,null,null,null,null,null,null,null,null,null,null,null,"FUSAGASUGA",{"$error":"#N/A"},12,2010,8423000,2129]
[null,null,null,null,null,null,null,null,null,null,null,null,null,"GIRARDOT",{"$error":"#N/A"},12,2010,15240000,3369]
[null,null,null,null,null,null,null,null,null,null,null,null,null,"IBAGUE",{"$f":"+VLOOKUP(N1987,$U$2:$V$16,2,FALSE)","v":"SI"},12,2010,332089800,46594]
[null,null,null,null,null,null,null,null,null,null,null,null,null,"MANIZALES","SI",12,2010,343747950,49659]
[null,null,null,null,null,null,null,null,null,null,null,null,null,"MEDELLIN","SI",12,2010,2425531350,281808]
[null,null,null,null,null,null,null,null,null,null,null,null,null,"MELGAR",{"$error":"#N/A"},12,2010,6791000,1520]
[null,null,null,null,null,null,null,null,null,null,null,null,null,"MONTERIA",{"$error":"#N/A"},12,2010,190345500,21681]
[null,null,null,null,null,null,null,null,null,null,null,null,null,"NEIVA","SI",12,2010,249855250,43465]
[null,null,null,null,null,null,null,null,null,null,null,null,null,"PALMIRA",{"$error":"#N/A"},12,2010,123112250,21233]
[null,null,null,null,null,null,null,null,null,null,null,null,null,"PASTO",{"$error":"#N/A"},12,2010,103750000,14332]
[null,null,null,null,null,null,null,null,null,null,null,null,null,"PEREIRA","SI",12,2010,458028800,57196]
[null,null,null,null,null,null,null,null,null,null,null,null,null,"PITALITO",{"$error":"#N/A"},12,2010,25135000,5072]
[null,null,null,null,null,null,null,null,null,null,null,null,null,"POPAYAN",{"$error":"#N/A"},12,2010,143218000,19683]
[null,null,null,null,null,null,null,null,null,null,null,null,null,"RIONEGRO",{"$error":"#N/A"},12,2010,143308000,21749]
[null,null,null,null,null,null,null,null,null,null,null,null,null,"SAN ANDRES",{"$error":"#N/A"},12,2010,30708000,4114]
[null,null,null,null,null,null,null,null,null,null,null,null,null,"SANTA MARTA","SI",12,2010,278569250,43405]
[null,null,null,null,null,null,null,null,null,null,null,null,null,"SINCELEJO",{"$error":"#N/A"},12,2010,123020250,20894]
[null,null,null,null,null,null,null,null,null,null,null,null,null,"SOGAMOSO",{"$error":"#N/A"},12,2010,2391000,471]
[null,null,null,null,null,null,null,null,null,null,null,null,null,"TULUA",{"$error":"#N/A"},12,2010,91352000,15587]
[null,null,null,null,null,null,null,null,null,null,null,null,null,"TUNJA",{"$error":"#N/A"},12,2010,126272000,22831]
[null,null,null,null,null,null,null,null,null,null,null,null,null,"VALLEDUPAR","SI",12,2010,191048900,28175]
[null,null,null,null,null,null,null,null,null,null,null,null,null,"VILLAVICENCIO","SI",12,2010,449568500,74442]
[null,null,null,null,null,null,null,null,null,null,null,null,null,"YOPAL",{"$error":"#N/A"},12,2010,17965500,3054]
[null,null,null,null,null,null,null,null,null,null,null,null,null,"ZIPAQUIRA",{"$error":"#N/A"},12,2010,37965000,7593]
[null,null,null,null,null,null,null,null,null,null,null,null,null,"APARTADO",{"$error":"#N/A"},1,2011,63788000,10884]
[null,null,null,null,null,null,null,null,null,null,null,null,null,"ARMENIA",{"$error":"#N/A"},1,2011,298977400,38008]
[null,null,null,null,null,null,null,null,null,null,null,null,null,"BARRANCABERMEJA",{"$error":"#N/A"},1,2011,406032000,42237]
[null,null,null,null,null,null,null,null,null,null,null,null,null,"BARRANQUILLA","SI",1,2011,1350036350,168357]
[null,null,null,null,null,null,null,null,null,null,null,null,null,"BELLO",{"$error":"#N/A"},1,2011,297490400,34739]
[null,null,null,null,null,null,null,null,null,null,null,null,null,"BOGOTA","SI",1,2011,14888443700,1822187]
[null,null,null,null,null,null,null,null,null,null,null,null,null,"BUCARAMANGA","SI",1,2011,833211850,125701]
[null,null,null,null,null,null,null,null,null,null,null,null,null,"BUENAVENTURA",{"$error":"#N/A"},1,2011,91436950,18258]
[null,null,null,null,null,null,null,null,null,null,null,null,null,"BUGA",{"$error":"#N/A"},1,2011,8560000,2167]
[null,null,null,null,null,null,null,null,null,null,null,null,null,"CALI","SI",1,2011,3313476450,418480]
[null,null,null,null,null,null,null,null,null,null,null,null,null,"CARTAGENA","SI",1,2011,817853550,121939]
[null,null,null,null,null,null,null,null,null,null,null,null,null,"CARTAGO",{"$error":"#N/A"},1,2011,72107000,9703]
[null,null,null,null,null,null,null,null,null,null,null,null,null,"CHIA",{"$error":"#N/A"},1,2011,465874800,48770]
[null,null,null,null,null,null,null,null,null,null,null,null,null,"CUCUTA","SI",1,2011,897818550,116526]
[null,null,null,null,null,null,null,null,null,null,null,null,null,"DUITAMA",{"$error":"#N/A"},1,2011,34014000,5683]
[null,null,null,null,null,null,null,null,null,null,null,null,null,"ENVIGADO",{"$error":"#N/A"},1,2011,864000,144]
[null,null,null,null,null,null,null,null,null,null,null,null,null,"FACATATIVA",{"$error":"#N/A"},1,2011,36885000,7377]
[null,null,null,null,null,null,null,null,null,null,null,null,null,"FLORENCIA",{"$error":"#N/A"},1,2011,23054500,3818]
[null,null,null,null,null,null,null,null,null,null,null,null,null,"FLORIDABLANCA","SI",1,2011,768510000,90607]
[null,null,null,null,null,null,null,null,null,null,null,null,null,"FUSAGASUGA",{"$error":"#N/A"},1,2011,10655500,2516]
[null,null,null,null,null,null,null,null,null,null,null,null,null,"GIRARDOT",{"$error":"#N/A"},1,2011,31521000,5284]
[null,null,null,null,null,null,null,null,null,null,null,null,null,"IBAGUE","SI",1,2011,558736750,65425]
[null,null,null,null,null,null,null,null,null,null,null,null,null,"MANIZALES","SI",1,2011,499711000,68534]
[null,null,null,null,null,null,null,null,null,null,null,null,null,"MEDELLIN","SI",1,2011,3519433300,418541]
[null,null,null,null,null,null,null,null,null,null,null,null,null,"MELGAR",{"$error":"#N/A"},1,2011,6042500,1250]
[null,null,null,null,null,null,null,null,null,null,null,null,null,"MONTERIA",{"$error":"#N/A"},1,2011,236023300,26537]
[null,null,null,null,null,null,null,null,null,null,null,null,null,"NEIVA","SI",1,2011,389566000,59793]
[null,null,null,null,null,null,null,null,null,null,null,null,null,"PALMIRA",{"$error":"#N/A"},1,2011,230943000,36275]
[null,null,null,null,null,null,null,null,null,null,null,null,null,"PASTO",{"$error":"#N/A"},1,2011,137469000,20429]
[null,null,null,null,null,null,null,null,null,null,null,null,null,"PEREIRA","SI",1,2011,679568000,85638]
[null,null,null,null,null,null,null,null,null,null,null,null,null,"PITALITO",{"$error":"#N/A"},1,2011,37875000,7608]
[null,null,null,null,null,null,null,null,null,null,null,null,null,"POPAYAN",{"$error":"#N/A"},1,2011,197813000,27087]
[null,null,null,null,null,null,null,null,null,null,null,null,null,"RIONEGRO",{"$error":"#N/A"},1,2011,284633500,33794]
[null,null,null,null,null,null,null,null,null,null,null,null,null,"SAN ANDRES",{"$error":"#N/A"},1,2011,32916000,4392]
[null,null,null,null,null,null,null,null,null,null,null,null,null,"SANTA MARTA","SI",1,2011,465686000,62705]
[null,null,null,null,null,null,null,null,null,null,null,null,null,"SINCELEJO",{"$error":"#N/A"},1,2011,169854200,24318]
[null,null,null,null,null,null,null,null,null,null,null,null,null,"SOGAMOSO",{"$error":"#N/A"},1,2011,2971000,568]
[null,null,null,null,null,null,null,null,null,null,null,null,null,"TULUA",{"$error":"#N/A"},1,2011,177183000,24407]
[null,null,null,null,null,null,null,null,null,null,null,null,null,"TUNJA",{"$error":"#N/A"},1,2011,281184750,36312]
[null,null,null,null,null,null,null,null,null,null,null,null,null,"VALLEDUPAR","SI",1,2011,277768750,35189]
[null,null,null,null,null,null,null,null,null,null,null,null,null,"VILLAVICENCIO","SI",1,2011,643505500,108333]
[null,null,null,null,null,null,null,null,null,null,null,null,null,"YOPAL",{"$error":"#N/A"},1,2011,18654000,3167]
[null,null,null,null,null,null,null,null,null,null,null,null,null,"ZIPAQUIRA",{"$f":"+VLOOKUP(N2051,$U$2:$V$16,2,FALSE)","v":{"$error":"#N/A"}},1,2011,79630000,15926]
[null,null,null,null,null,null,null,null,null,null,null,null,null,"APARTADO",{"$error":"#N/A"},2,2011,30348500,4887]
[null,null,null,null,null,null,null,null,null,null,null,null,null,"ARMENIA",{"$error":"#N/A"},2,2011,128729000,16971]
[null,null,null,null,null,null,null,null,null,null,null,null,null,"BARRANCABERMEJA",{"$error":"#N/A"},2,2011,185981000,21213]
[null,null,null,null,null,null,null,null,null,null,null,null,null,"BARRANQUILLA","SI",2,2011,567872980,72296]
[null,null,null,null,null,null,null,null,null,null,null,null,null,"BELLO",{"$error":"#N/A"},2,2011,143542700,16730]
[null,null,null,null,null,null,null,null,null,null,null,null,null,"BOGOTA","SI",2,2011,7411168300,899945]
[null,null,null,null,null,null,null,null,null,null,null,null,null,"BUCARAMANGA","SI",2,2011,370549240,56794]
[null,null,null,null,null,null,null,null,null,null,null,null,null,"BUENAVENTURA",{"$error":"#N/A"},2,2011,48105914,10259]
[null,null,null,null,null,null,null,null,null,null,null,null,null,"BUGA",{"$error":"#N/A"},2,2011,8892000,2332]
[null,null,null,null,null,null,null,null,null,null,null,null,null,"CALI","SI",2,2011,1730454939,220368]
[null,null,null,null,null,null,null,null,null,null,null,null,null,"CARTAGENA","SI",2,2011,328362840,52578]
[null,null,null,null,null,null,null,null,null,null,null,null,null,"CARTAGO",{"$error":"#N/A"},2,2011,38453000,5355]
[null,null,null,null,null,null,null,null,null,null,null,null,null,"CHIA",{"$error":"#N/A"},2,2011,240154700,24818]
[null,null,null,null,null,null,null,null,null,null,null,null,null,"CUCUTA","SI",2,2011,410935540,49632]
[null,null,null,null,null,null,null,null,null,null,null,null,null,"DUITAMA",{"$error":"#N/A"},2,2011,16905000,2112]
[null,null,null,null,null,null,null,null,null,null,null,null,null,"ENVIGADO",{"$error":"#N/A"},2,2011,1272000,212]
[null,null,null,null,null,null,null,null,null,null,null,null,null,"FACATATIVA",{"$error":"#N/A"},2,2011,20235000,4047]
[null,null,null,null,null,null,null,null,null,null,null,null,null,"FLORENCIA",{"$error":"#N/A"},2,2011,18964000,3113]
[null,null,null,null,null,null,null,null,null,null,null,null,null,"FLORIDABLANCA","SI",2,2011,320773500,36294]
[null,null,null,null,null,null,null,null,null,null,null,null,null,"FUSAGASUGA",{"$error":"#N/A"},2,2011,7545000,1649]
[null,null,null,null,null,null,null,null,null,null,null,null,null,"GIRARDOT",{"$error":"#N/A"},2,2011,5507000,976]
[null,null,null,null,null,null,null,null,null,null,null,null,null,"IBAGUE","SI",2,2011,210576250,25322]
[null,null,null,null,null,null,null,null,null,null,null,null,null,"MANIZALES","SI",2,2011,226827600,31059]
[null,null,null,null,null,null,null,null,null,null,null,null,null,"MEDELLIN","SI",2,2011,1866965800,220788]
[null,null,null,null,null,null,null,null,null,null,null,null,null,"MELGAR",{"$error":"#N/A"},2,2011,3972000,822]
[null,null,null,null,null,null,null,null,null,null,null,null,null,"NEIVA","SI",2,2011,158564500,24234]
[null,null,null,null,null,null,null,null,null,null,null,null,null,"PALMIRA",{"$error":"#N/A"},2,2011,108328000,17034]
[null,null,null,null,null,null,null,null,null,null,null,null,null,"PASTO",{"$error":"#N/A"},2,2011,63940500,9911]
[null,null,null,null,null,null,null,null,null,null,null,null,null,"PEREIRA","SI",2,2011,373928640,46047]
[null,null,null,null,null,null,null,null,null,null,null,null,null,"PITALITO",{"$error":"#N/A"},2,2011,21627000,4467]
[null,null,null,null,null,null,null,null,null,null,null,null,null,"POPAYAN",{"$error":"#N/A"},2,2011,75127000,10548]
[null,null,null,null,null,null,null,null,null,null,null,null,null,"RIONEGRO",{"$error":"#N/A"},2,2011,114739600,13961]
[null,null,null,null,null,null,null,null,null,null,null,null,null,"SAN ANDRES",{"$error":"#N/A"},2,2011,17652000,2351]
[null,null,null,null,null,null,null,null,null,null,null,null,null,"SANTA MARTA","SI",2,2011,171022000,23738]
[null,null,null,null,null,null,null,null,null,null,null,null,null,"SINCELEJO",{"$error":"#N/A"},2,2011,66485340,10152]
[null,null,null,null,null,null,null,null,null,null,null,null,null,"SOGAMOSO",{"$error":"#N/A"},2,2011,2570000,458]
[null,null,null,null,null,null,null,null,null,null,null,null,null,"TULUA",{"$error":"#N/A"},2,2011,59343500,8967]
[null,null,null,null,null,null,null,null,null,null,null,null,null,"TUNJA",{"$error":"#N/A"},2,2011,112894750,13886]
[null,null,null,null,null,null,null,null,null,null,null,null,null,"VALLEDUPAR","SI",2,2011,117791750,15678]
[null,null,null,null,null,null,null,null,null,null,null,null,null,"VILLAVICENCIO","SI",2,2011,276935000,48948]
[null,null,null,null,null,null,null,null,null,null,null,null,null,"YOPAL",{"$error":"#N/A"},2,2011,8251000,1608]
[null,null,null,null,null,null,null,null,null,null,null,null,null,"ZIPAQUIRA",{"$error":"#N/A"},2,2011,28690000,5738]
[null,null,null,null,null,null,null,null,null,null,null,null,null,"APARTADO",{"$error":"#N/A"},3,2011,38031000,6154]
[null,null,null,null,null,null,null,null,null,null,null,null,null,"ARMENIA",{"$error":"#N/A"},3,2011,169079750,25101]
[null,null,null,null,null,null,null,null,null,null,null,null,null,"BARRANCABERMEJA",{"$error":"#N/A"},3,2011,205132000,23825]
[null,null,null,null,null,null,null,null,null,null,null,null,null,"BARRANQUILLA","SI",3,2011,841138900,111037]
[null,null,null,null,null,null,null,null,null,null,null,null,null,"BELLO",{"$error":"#N/A"},3,2011,173265100,21517]
[null,null,null,null,null,null,null,null,null,null,null,null,null,"BOGOTA","SI",3,2011,8696370550,1123616]
[null,null,null,null,null,null,null,null,null,null,null,null,null,"BUCARAMANGA","SI",3,2011,412146650,69383]
[null,null,null,null,null,null,null,null,null,null,null,null,null,"BUENAVENTURA",{"$error":"#N/A"},3,2011,58457554,12665]
[null,null,null,null,null,null,null,null,null,null,null,null,null,"BUGA",{"$error":"#N/A"},3,2011,10086000,2601]
[null,null,null,null,null,null,null,null,null,null,null,null,null,"CALI","SI",3,2011,2022045350,276706]
[null,null,null,null,null,null,null,null,null,null,null,null,null,"CARTAGENA","SI",3,2011,475834200,78267]
[null,null,null,null,null,null,null,null,null,null,null,null,null,"CARTAGO",{"$error":"#N/A"},3,2011,41541500,5773]
[null,null,null,null,null,null,null,null,null,null,null,null,null,"CHIA",{"$error":"#N/A"},3,2011,281840050,31079]
[null,null,null,null,null,null,null,null,null,null,null,null,null,"CUCUTA","SI",3,2011,440160800,60396]
[null,null,null,null,null,null,null,null,null,null,null,null,null,"DUITAMA",{"$error":"#N/A"},3,2011,15171000,2624]
[null,null,null,null,null,null,null,null,null,null,null,null,null,"ENVIGADO",{"$error":"#N/A"},3,2011,966000,161]
[null,null,null,null,null,null,null,null,null,null,null,null,null,"FACATATIVA",{"$error":"#N/A"},3,2011,18325000,3665]
[null,null,null,null,null,null,null,null,null,null,null,null,null,"FLORENCIA",{"$error":"#N/A"},3,2011,16807500,2842]
[null,null,null,null,null,null,null,null,null,null,null,null,null,"FLORIDABLANCA","SI",3,2011,393358250,52696]
[null,null,null,null,null,null,null,null,null,null,null,null,null,"FUSAGASUGA",{"$error":"#N/A"},3,2011,3902000,866]
[null,null,null,null,null,null,null,null,null,null,null,null,null,"GIRARDOT",{"$error":"#N/A"},3,2011,3183000,555]
[null,null,null,null,null,null,null,null,null,null,null,null,null,"IBAGUE",{"$f":"+VLOOKUP(N2115,$U$2:$V$16,2,FALSE)","v":"SI"},3,2011,262299500,33392]
[null,null,null,null,null,null,null,null,null,null,null,null,null,"MANIZALES","SI",3,2011,274772700,41069]
[null,null,null,null,null,null,null,null,null,null,null,null,null,"MEDELLIN","SI",3,2011,2376014450,301712]
[null,null,null,null,null,null,null,null,null,null,null,null,null,"MELGAR",{"$error":"#N/A"},3,2011,1635000,348]
[null,null,null,null,null,null,null,null,null,null,null,null,null,"NEIVA","SI",3,2011,228876000,35639]
[null,null,null,null,null,null,null,null,null,null,null,null,null,"PALMIRA",{"$error":"#N/A"},3,2011,126235000,20051]
[null,null,null,null,null,null,null,null,null,null,null,null,null,"PASTO",{"$error":"#N/A"},3,2011,67183000,11098]
[null,null,null,null,null,null,null,null,null,null,null,null,null,"PEREIRA","SI",3,2011,478071300,66700]
[null,null,null,null,null,null,null,null,null,null,null,null,null,"PITALITO",{"$error":"#N/A"},3,2011,20205000,4192]
[null,null,null,null,null,null,null,null,null,null,null,null,null,"POPAYAN",{"$error":"#N/A"},3,2011,81139000,12563]
[null,null,null,null,null,null,null,null,null,null,null,null,null,"RIONEGRO",{"$error":"#N/A"},3,2011,120632000,16661]
[null,null,null,null,null,null,null,null,null,null,null,null,null,"SAN ANDRES",{"$error":"#N/A"},3,2011,17841000,2344]
[null,null,null,null,null,null,null,null,null,null,null,null,null,"SANTA MARTA","SI",3,2011,228489000,34026]
[null,null,null,null,null,null,null,null,null,null,null,null,null,"SINCELEJO",{"$error":"#N/A"},3,2011,80794950,14298]
[null,null,null,null,null,null,null,null,null,null,null,null,null,"SOGAMOSO",{"$error":"#N/A"},3,2011,1389000,244]
[null,null,null,null,null,null,null,null,null,null,null,null,null,"TULUA",{"$error":"#N/A"},3,2011,66251500,11585]
[null,null,null,null,null,null,null,null,null,null,null,null,null,"TUNJA",{"$error":"#N/A"},3,2011,118319500,16210]
[null,null,null,null,null,null,null,null,null,null,null,null,null,"VALLEDUPAR","SI",3,2011,142748750,20457]
[null,null,null,null,null,null,null,null,null,null,null,null,null,"VILLAVICENCIO","SI",3,2011,297637500,58322]
[null,null,null,null,null,null,null,null,null,null,null,null,null,"YOPAL",{"$error":"#N/A"},3,2011,8071000,1694]
[null,null,null,null,null,null,null,null,null,null,null,null,null,"ZIPAQUIRA",{"$error":"#N/A"},3,2011,26865000,5373]
[null,null,null,null,null,null,null,null,null,null,null,null,null,"APARTADO",{"$error":"#N/A"},4,2011,43462500,7058]
[null,null,null,null,null,null,null,null,null,null,null,null,null,"ARMENIA",{"$error":"#N/A"},4,2011,229679800,29010]
[null,null,null,null,null,null,null,null,null,null,null,null,null,"BARRANCABERMEJA",{"$error":"#N/A"},4,2011,266657250,28627]
[null,null,null,null,null,null,null,null,null,null,null,null,null,"BARRANQUILLA","SI",4,2011,1144534300,144809]
[null,null,null,null,null,null,null,null,null,null,null,null,null,"BELLO",{"$error":"#N/A"},4,2011,227801600,26410]
[null,null,null,null,null,null,null,null,null,null,null,null,null,"BOGOTA","SI",4,2011,10942130850,1360743]
[null,null,null,null,null,null,null,null,null,null,null,null,null,"BUCARAMANGA","SI",4,2011,626697250,89736]
[null,null,null,null,null,null,null,null,null,null,null,null,null,"BUENAVENTURA",{"$error":"#N/A"},4,2011,63872068,13863]
[null,null,null,null,null,null,null,null,null,null,null,null,null,"BUGA",{"$error":"#N/A"},4,2011,8522000,2200]
[null,null,null,null,null,null,null,null,null,null,null,null,null,"CALI","SI",4,2011,2685110850,340281]
[null,null,null,null,null,null,null,null,null,null,null,null,null,"CARTAGENA","SI",4,2011,672615000,102533]
[null,null,null,null,null,null,null,null,null,null,null,null,null,"CARTAGO",{"$error":"#N/A"},4,2011,90733500,10180]
[null,null,null,null,null,null,null,null,null,null,null,null,null,"CHIA",{"$error":"#N/A"},4,2011,338092600,35821]
[null,null,null,null,null,null,null,null,null,null,null,null,null,"CUCUTA","SI",4,2011,611245500,78694]
[null,null,null,null,null,null,null,null,null,null,null,null,null,"DUITAMA",{"$error":"#N/A"},4,2011,83295500,15242]
[null,null,null,null,null,null,null,null,null,null,null,null,null,"ENVIGADO",{"$error":"#N/A"},4,2011,288000,48]
[null,null,null,null,null,null,null,null,null,null,null,null,null,"FACATATIVA",{"$error":"#N/A"},4,2011,29150000,5830]
[null,null,null,null,null,null,null,null,null,null,null,null,null,"FLORENCIA",{"$error":"#N/A"},4,2011,23262500,3973]
[null,null,null,null,null,null,null,null,null,null,null,null,null,"FLORIDABLANCA","SI",4,2011,499858750,58500]
[null,null,null,null,null,null,null,null,null,null,null,null,null,"FUSAGASUGA",{"$error":"#N/A"},4,2011,13165000,2753]
[null,null,null,null,null,null,null,null,null,null,null,null,null,"GIRARDOT",{"$error":"#N/A"},4,2011,15381000,2712]
[null,null,null,null,null,null,null,null,null,null,null,null,null,"IBAGUE","SI",4,2011,387891250,45625]
[null,null,null,null,null,null,null,null,null,null,null,null,null,"MANIZALES","SI",4,2011,365675500,50434]
[null,null,null,null,null,null,null,null,null,null,null,null,null,"MEDELLIN","SI",4,2011,2861022950,333402]
[null,null,null,null,null,null,null,null,null,null,null,null,null,"MELGAR",{"$error":"#N/A"},4,2011,8381000,1677]
[null,null,null,null,null,null,null,null,null,null,null,null,null,"NEIVA","SI",4,2011,258121250,39944]
[null,null,null,null,null,null,null,null,null,null,null,null,null,"PALMIRA",{"$error":"#N/A"},4,2011,144723500,23127]
[null,null,null,null,null,null,null,null,null,null,null,null,null,"PASTO",{"$error":"#N/A"},4,2011,115566500,14852]
[null,null,null,null,null,null,null,null,null,null,null,null,null,"PEREIRA","SI",4,2011,650118500,79880]
[null,null,null,null,null,null,null,null,null,null,null,null,null,"PITALITO",{"$error":"#N/A"},4,2011,27738000,5755]
[null,null,null,null,null,null,null,null,null,null,null,null,null,"POPAYAN",{"$error":"#N/A"},4,2011,142172000,18298]
[null,null,null,null,null,null,null,null,null,null,null,null,null,"RIONEGRO",{"$error":"#N/A"},4,2011,179326000,21744]
[null,null,null,null,null,null,null,null,null,null,null,null,null,"SAN ANDRES",{"$error":"#N/A"},4,2011,25702000,3454]
[null,null,null,null,null,null,null,null,null,null,null,null,null,"SANTA MARTA","SI",4,2011,323709000,44163]
[null,null,null,null,null,null,null,null,null,null,null,null,null,"SINCELEJO",{"$error":"#N/A"},4,2011,146684450,21716]
[null,null,null,null,null,null,null,null,null,null,null,null,null,"SOGAMOSO",{"$error":"#N/A"},4,2011,3974000,760]
[null,null,null,null,null,null,null,null,null,null,null,null,null,"TULUA",{"$error":"#N/A"},4,2011,115640500,15711]
[null,null,null,null,null,null,null,null,null,null,null,null,null,"TUNJA",{"$error":"#N/A"},4,2011,174545750,22072]
[null,null,null,null,null,null,null,null,null,null,null,null,null,"VALLEDUPAR","SI",4,2011,195610000,25212]
[null,null,null,null,null,null,null,null,null,null,null,null,null,"VILLAVICENCIO","SI",4,2011,448029500,77199]
[null,null,null,null,null,null,null,null,null,null,null,null,null,"YOPAL",{"$error":"#N/A"},4,2011,14239000,2523]
[null,null,null,null,null,null,null,null,null,null,null,null,null,"ZIPAQUIRA",{"$error":"#N/A"},4,2011,39595000,7919]
[null,null,null,null,null,null,null,null,null,null,null,null,null,"APARTADO",{"$error":"#N/A"},5,2011,43830500,6996]
[null,null,null,null,null,null,null,null,null,null,null,null,null,"ARMENIA",{"$f":"+VLOOKUP(N2179,$U$2:$V$16,2,FALSE)","v":{"$error":"#N/A"}},5,2011,200681200,27223]
[null,null,null,null,null,null,null,null,null,null,null,null,null,"BARRANCABERMEJA",{"$error":"#N/A"},5,2011,261213750,28672]
[null,null,null,null,null,null,null,null,null,null,null,null,null,"BARRANQUILLA","SI",5,2011,1236532150,157767]
[null,null,null,null,null,null,null,null,null,null,null,null,null,"BELLO",{"$error":"#N/A"},5,2011,234603500,28006]
[null,null,null,null,null,null,null,null,null,null,null,null,null,"BOGOTA","SI",5,2011,10938300400,1317808]
[null,null,null,null,null,null,null,null,null,null,null,null,null,"BUCARAMANGA","SI",5,2011,653283850,90296]
[null,null,null,null,null,null,null,null,null,null,null,null,null,"BUENAVENTURA",{"$error":"#N/A"},5,2011,94245810,19618]
[null,null,null,null,null,null,null,null,null,null,null,null,null,"BUGA",{"$error":"#N/A"},5,2011,10984000,2816]
[null,null,null,null,null,null,null,null,null,null,null,null,null,"CALI","SI",5,2011,2665095200,338723]
[null,null,null,null,null,null,null,null,null,null,null,null,null,"CARTAGENA","SI",5,2011,727940700,114056]
[null,null,null,null,null,null,null,null,null,null,null,null,null,"CARTAGO",{"$error":"#N/A"},5,2011,88254000,10204]
[null,null,null,null,null,null,null,null,null,null,null,null,null,"CHIA",{"$error":"#N/A"},5,2011,300145600,31744]
[null,null,null,null,null,null,null,null,null,null,null,null,null,"CUCUTA","SI",5,2011,576902500,73410]
[null,null,null,null,null,null,null,null,null,null,null,null,null,"DUITAMA",{"$error":"#N/A"},5,2011,72051500,13213]
[null,null,null,null,null,null,null,null,null,null,null,null,null,"ENVIGADO",{"$error":"#N/A"},5,2011,696000,116]
[null,null,null,null,null,null,null,null,null,null,null,null,null,"FACATATIVA",{"$error":"#N/A"},5,2011,28640000,5728]
[null,null,null,null,null,null,null,null,null,null,null,null,null,"FLORENCIA",{"$error":"#N/A"},5,2011,24148500,3947]
[null,null,null,null,null,null,null,null,null,null,null,null,null,"FLORIDABLANCA","SI",5,2011,483479250,55664]
[null,null,null,null,null,null,null,null,null,null,null,null,null,"FUSAGASUGA",{"$error":"#N/A"},5,2011,3634000,763]
[null,null,null,null,null,null,null,null,null,null,null,null,null,"GIRARDOT",{"$error":"#N/A"},5,2011,10865000,1925]
[null,null,null,null,null,null,null,null,null,null,null,null,null,"IBAGUE","SI",5,2011,369449500,40637]
[null,null,null,null,null,null,null,null,null,null,null,null,null,"MANIZALES","SI",5,2011,336318100,45396]
[null,null,null,null,null,null,null,null,null,null,null,null,null,"MEDELLIN","SI",5,2011,2984081400,345105]
[null,null,null,null,null,null,null,null,null,null,null,null,null,"MELGAR",{"$error":"#N/A"},5,2011,2463000,510]
[null,null,null,null,null,null,null,null,null,null,null,null,null,"NEIVA","SI",5,2011,259761000,40019]
[null,null,null,null,null,null,null,null,null,null,null,null,null,"PALMIRA",{"$error":"#N/A"},5,2011,177738500,28470]
[null,null,null,null,null,null,null,null,null,null,null,null,null,"PASTO",{"$error":"#N/A"},5,2011,131019000,18504]
[null,null,null,null,null,null,null,null,null,null,null,null,null,"PEREIRA","SI",5,2011,672933300,86932]
[null,null,null,null,null,null,null,null,null,null,null,null,null,"PITALITO",{"$error":"#N/A"},5,2011,24531000,5023]
[null,null,null,null,null,null,null,null,null,null,null,null,null,"POPAYAN",{"$error":"#N/A"},5,2011,142686500,19481]
[null,null,null,null,null,null,null,null,null,null,null,null,null,"RIONEGRO",{"$error":"#N/A"},5,2011,150330000,19567]
[null,null,null,null,null,null,null,null,null,null,null,null,null,"SAN ANDRES",{"$error":"#N/A"},5,2011,32148000,4240]
[null,null,null,null,null,null,null,null,null,null,null,null,null,"SANTA MARTA","SI",5,2011,347938500,50035]
[null,null,null,null,null,null,null,null,null,null,null,null,null,"SINCELEJO",{"$error":"#N/A"},5,2011,129676300,21402]
[null,null,null,null,null,null,null,null,null,null,null,null,null,"SOGAMOSO",{"$error":"#N/A"},5,2011,1186000,215]
[null,null,null,null,null,null,null,null,null,null,null,null,null,"TULUA",{"$error":"#N/A"},5,2011,127908500,20221]
[null,null,null,null,null,null,null,null,null,null,null,null,null,"TUNJA",{"$error":"#N/A"},5,2011,197703000,23682]
[null,null,null,null,null,null,null,null,null,null,null,null,null,"VALLEDUPAR","SI",5,2011,227055500,30604]
[null,null,null,null,null,null,null,null,null,null,null,null,null,"VILLAVICENCIO","SI",5,2011,456231500,76672]
[null,null,null,null,null,null,null,null,null,null,null,null,null,"YOPAL",{"$error":"#N/A"},5,2011,15456000,2576]
[null,null,null,null,null,null,null,null,null,null,null,null,null,"ZIPAQUIRA",{"$error":"#N/A"},5,2011,47135000,9427]
[null,null,null,null,null,null,null,null,null,null,null,null,null,"APARTADO",{"$error":"#N/A"},6,2011,64625500,10662]
[null,null,null,null,null,null,null,null,null,null,null,null,null,"ARMENIA",{"$error":"#N/A"},6,2011,223715450,32802]
[null,null,null,null,null,null,null,null,null,null,null,null,null,"BARRANCABERMEJA",{"$error":"#N/A"},6,2011,301506250,33478]
[null,null,null,null,null,null,null,null,null,null,null,null,null,"BARRANQUILLA","SI",6,2011,1297572150,164484]
[null,null,null,null,null,null,null,null,null,null,null,null,null,"BELLO",{"$error":"#N/A"},6,2011,284055200,31083]
[null,null,null,null,null,null,null,null,null,null,null,null,null,"BOGOTA","SI",6,2011,13298035200,1647571]
[null,null,null,null,null,null,null,null,null,null,null,null,null,"BUCARAMANGA","SI",6,2011,766503350,110103]
[null,null,null,null,null,null,null,null,null,null,null,null,null,"BUENAVENTURA",{"$error":"#N/A"},6,2011,84110038,16234]
[null,null,null,null,null,null,null,null,null,null,null,null,null,"BUGA",{"$error":"#N/A"},6,2011,18680000,4720]
[null,null,null,null,null,null,null,null,null,null,null,null,null,"CALI","SI",6,2011,2598814450,341966]
[null,null,null,null,null,null,null,null,null,null,null,null,null,"CARTAGENA","SI",6,2011,719964250,116466]
[null,null,null,null,null,null,null,null,null,null,null,null,null,"CARTAGO",{"$error":"#N/A"},6,2011,79136000,9525]
[null,null,null,null,null,null,null,null,null,null,null,null,null,"CHIA",{"$error":"#N/A"},6,2011,445927300,47595]
[null,null,null,null,null,null,null,null,null,null,null,null,null,"CUCUTA","SI",6,2011,655624500,81386]
[null,null,null,null,null,null,null,null,null,null,null,null,null,"DUITAMA",{"$error":"#N/A"},6,2011,94625500,17884]
[null,null,null,null,null,null,null,null,null,null,null,null,null,"ENVIGADO",{"$error":"#N/A"},6,2011,1182000,197]
[null,null,null,null,null,null,null,null,null,null,null,null,null,"FACATATIVA",{"$error":"#N/A"},6,2011,38730000,7746]
[null,null,null,null,null,null,null,null,null,null,null,null,null,"FLORENCIA",{"$error":"#N/A"},6,2011,27167000,4575]
[null,null,null,null,null,null,null,null,null,null,null,null,null,"FLORIDABLANCA","SI",6,2011,588600250,67870]
[null,null,null,null,null,null,null,null,null,null,null,null,null,"FUSAGASUGA",{"$error":"#N/A"},6,2011,13057000,2788]
[null,null,null,null,null,null,null,null,null,null,null,null,null,"GIRARDOT",{"$error":"#N/A"},6,2011,22819000,4071]
[null,null,null,null,null,null,null,null,null,null,null,null,null,"IBAGUE","SI",6,2011,442358500,50653]
[null,null,null,null,null,null,null,null,null,null,null,null,null,"MANIZALES","SI",6,2011,347846100,48167]
[null,null,null,null,null,null,null,null,null,null,null,null,null,"MEDELLIN",{"$f":"+VLOOKUP(N2243,$U$2:$V$16,2,FALSE)","v":"SI"},6,2011,3182009600,370269]
[null,null,null,null,null,null,null,null,null,null,null,null,null,"MELGAR",{"$error":"#N/A"},6,2011,7652000,1532]
[null,null,null,null,null,null,null,null,null,null,null,null,null,"NEIVA","SI",6,2011,271231500,43719]
[null,null,null,null,null,null,null,null,null,null,null,null,null,"OCAQA",{"$error":"#N/A"},6,2011,2268000,567]
[null,null,null,null,null,null,null,null,null,null,null,null,null,"PALMIRA",{"$error":"#N/A"},6,2011,165385500,26485]
[null,null,null,null,null,null,null,null,null,null,null,null,null,"PASTO",{"$error":"#N/A"},6,2011,125872000,19229]
[null,null,null,null,null,null,null,null,null,null,null,null,null,"PEREIRA","SI",6,2011,630724200,83623]
[null,null,null,null,null,null,null,null,null,null,null,null,null,"PITALITO",{"$error":"#N/A"},6,2011,30590000,6118]
[null,null,null,null,null,null,null,null,null,null,null,null,null,"POPAYAN",{"$error":"#N/A"},6,2011,139660000,19621]
[null,null,null,null,null,null,null,null,null,null,null,null,null,"RIONEGRO",{"$error":"#N/A"},6,2011,160042000,21264]
[null,null,null,null,null,null,null,null,null,null,null,null,null,"SAN ANDRES",{"$error":"#N/A"},6,2011,37456000,4965]
[null,null,null,null,null,null,null,null,null,null,null,null,null,"SANTA MARTA","SI",6,2011,401343250,51971]
[null,null,null,null,null,null,null,null,null,null,null,null,null,"SINCELEJO",{"$error":"#N/A"},6,2011,141970700,22545]
[null,null,null,null,null,null,null,null,null,null,null,null,null,"SOGAMOSO",{"$error":"#N/A"},6,2011,8017000,1423]
[null,null,null,null,null,null,null,null,null,null,null,null,null,"TULUA",{"$error":"#N/A"},6,2011,97334000,15069]
[null,null,null,null,null,null,null,null,null,null,null,null,null,"TUNJA",{"$error":"#N/A"},6,2011,224409500,25914]
[null,null,null,null,null,null,null,null,null,null,null,null,null,"VALLEDUPAR","SI",6,2011,258066000,34025]
[null,null,null,null,null,null,null,null,null,null,null,null,null,"VILLAVICENCIO","SI",6,2011,488102500,85499]
[null,null,null,null,null,null,null,null,null,null,null,null,null,"YOPAL",{"$error":"#N/A"},6,2011,14250000,2375]
[null,null,null,null,null,null,null,null,null,null,null,null,null,"ZIPAQUIRA",{"$error":"#N/A"},6,2011,51665000,10333]

{"sheet":"Salas de Exhibición","index":15,"n_rows":55,"n_cols":39,"rows_kept":55,"cut":false,"hidden":false,"merged":[]}
[null,{"$f":"+[1]a14_ind!T6","v":"COMPLEJOS"},{"$f":"+[1]a14_ind!U6","v":"SALAS"},{"$f":"+[1]a14_ind!V6","v":"Población"},{"$f":"+[1]a14_ind!W6","v":"Salas por millón de habitantes"}]
[null,"Complejos","Salas",null,"Salas por millón de habitantes"]
[{"$f":"+[1]a14_ind!S7","v":2006},{"$f":"+[1]a14_ind!T7","v":123},{"$f":"+[1]a14_ind!U7","v":424},{"$f":"+[1]a14_ind!V7","v":43405956},{"$f":"+[1]a14_ind!W7","v":9.7682447081686199}]
[{"$f":"+[1]a14_ind!S8","v":2007},{"$f":"+[1]a14_ind!T8","v":127},{"$f":"+[1]a14_ind!U8","v":462},{"$f":"+[1]a14_ind!V8","v":43926929},{"$f":"+[1]a14_ind!W8","v":10.517466404264226},null,null,null,null,null,null,null,null,null,null,null,null,null,null,null,null,null,null,null,null,null,null,null,null,null,null,"Salas por ciudad"]
[{"$f":"+[1]a14_ind!S9","v":2008},{"$f":"+[1]a14_ind!T9","v":138},{"$f":"+[1]a14_ind!U9","v":536},{"$f":"+[1]a14_ind!V9","v":44451147},{"$f":"+[1]a14_ind!W9","v":12.058181535788043},null,null,null,null,null,null,null,null,null,null,null,null,null,null,null,null,null,null,null,null,null,null,null,null,null,null,"Etiquetas de fila",0]
[{"$f":"+[1]a14_ind!S10","v":2009},{"$f":"+[1]a14_ind!T10","v":125},{"$f":"+[1]a14_ind!U10","v":530},{"$f":"+[1]a14_ind!V10","v":44978832},{"$f":"+[1]a14_ind!W10","v":11.783320651812391},null,null,null,null,null,null,null,null,null,null,null,null,null,null,null,null,null,null,null,null,null,null,null,null,null,null,null,null,"CINE COLOMBIA","CINEMARK","PROCINAL","RESTO","ROYAL FILMS LTDA","Total general"]
[{"$f":"+[1]a14_ind!S11","v":2010},{"$f":"+[1]a14_ind!T11","v":128},{"$f":"+[1]a14_ind!U11","v":588},{"$f":"+[1]a14_ind!V11","v":45509584},{"$f":"+[1]a14_ind!W11","v":12.92035541348829},null,null,null,null,null,null,null,null,null,null,null,null,null,null,null,null,null,null,null,null,null,null,null,null,null,null,2011,null,{"$f":"+PROPER(AH6)","v":"Cine Colombia"},{"$f":"+PROPER(AI6)","v":"Cinemark"},"Procinal","Resto","Royal Films Ltda","Total General"]
[{"$f":"+[1]a14_ind!S12","v":"2011*"},{"$f":"+[1]a14_ind!T12","v":127},{"$f":"+[1]a14_ind!U12","v":591},{"$f":"+[1]a14_ind!V12","v":46044601},{"$f":"+[1]a14_ind!W12","v":12.83538106889014},null,null,null,null,null,null,null,null,null,null,null,null,null,null,null,null,null,null,null,null,null,null,null,null,null,null,"BARRANQUILLA",{"$f":"+PROPER(AF8)","v":"Barranquilla"},8,null,null,null,23,31]
[null,null,null,null,null,null,null,null,null,null,null,null,null,null,null,null,null,null,null,null,null,null,null,null,null,null,null,null,null,null,null,"CALI",{"$f":"+PROPER(AF9)","v":"Cali"},38,null,null,17,13,68]
[null,null,null,null,null,null,null,null,null,null,null,null,null,null,null,null,null,null,null,null,null,null,null,null,null,null,null,null,null,null,null,"MEDELLIN",{"$f":"+PROPER(AF10)","v":"Medellin"},30,10,23,2,12,77]
[null,null,null,null,null,null,null,null,null,null,null,null,null,null,null,null,null,null,null,null,null,null,null,null,null,null,null,null,null,null,null,"RESTO",{"$f":"+PROPER(AF11)","v":"Resto"},44,50,23,50,37,204]
[null,null,null,null,null,null,null,null,null,null,null,null,null,null,null,null,null,null,null,null,null,null,null,null,null,null,null,null,null,null,null,"BOGOTA",{"$f":"+PROPER(AF12)","v":"Bogota"},105,26,63,17,null,211]
[null,null,null,null,null,null,null,null,null,null,null,null,null,null,null,null,null,null,null,null,null,null,null,null,null,null,null,null,null,null,null,null,null,225,86,109,86,85,591]
[{"$f":"+[1]a14_ind!S18","v":"2011*"}]
[{"$f":"+[1]a14_ind!S19","v":"EXHIBIDOR"},{"$f":"+[1]a14_ind!T19","v":"COMPLEJOS"},{"$f":"+[1]a14_ind!U19","v":"SALAS"},{"$f":"+[1]a14_ind!V19","v":"PARTICIPACIÓN COMPLEJOS"},{"$f":"+[1]a14_ind!W19","v":"PARTICIPACIÓN SALAS"}]
[{"$f":"+[1]a14_ind!S20","v":"CINE COLOMBIA"},{"$f":"+[1]a14_ind!T20","v":35},{"$f":"+[1]a14_ind!U20","v":225},null,null,null,null,null,null,null,null,null,null,null,null,null,null,null,null,null,null,null,null,null,null,null,null,null,null,null,null,"Distribución de salas de cine por ciudad"]
[{"$f":"+[1]a14_ind!S21","v":"PROCINAL"},{"$f":"+[1]a14_ind!T21","v":23},{"$f":"+[1]a14_ind!U21","v":109}]
[{"$f":"+[1]a14_ind!S22","v":"CINEMARK"},{"$f":"+[1]a14_ind!T22","v":16},{"$f":"+[1]a14_ind!U22","v":86}]
[{"$f":"+[1]a14_ind!S23","v":"ROYAL FILMS LTDA"},{"$f":"+[1]a14_ind!T23","v":19},{"$f":"+[1]a14_ind!U23","v":85}]
[{"$f":"+[1]a14_ind!S24","v":"RESTO"},{"$f":"+[1]a14_ind!T24","v":34},{"$f":"+[1]a14_ind!U24","v":86}]
[{"$f":"+[1]a14_ind!S25","v":"TOTALES"},{"$f":"+[1]a14_ind!T25","v":127},{"$f":"+[1]a14_ind!U25","v":591}]
[]
["2011*"]
["EXHIBIDOR","Complejos ","Salas"]
["Cine Colombia",35,225]
["Procinal",23,109]
["Cine Mark",16,86]
["Royal Films",19,85]
["Resto",34,86]
[]
[null,null,null,null,null,"Salas de exhibición en Colombia"]
[null,null,null,null,null,"2006 –  2011*"]
[]
[]
[]
[]
[]
[]
[]
[]
[]
[]
[]
[]
[]
[]
[]
[]
[]
[]
[]
[]
[]
[null,null,null,null,null,null,null,null,null,"a14","Complejos"]
[null,null,null,null,null,null,null,null,null,null,null,null,null,null,null,null,null,null,null,null,null,null,"a14","Salas"]

{"sheet":"Asistencia cine por ciudades","index":16,"n_rows":57,"n_cols":9,"rows_kept":57,"cut":false,"hidden":false,"merged":[]}
[null,{"$f":"+'[1]a1_1 ind'!Z2","v":"Admisiones"}]
[{"$f":"+'[1]a1_1 ind'!Y3","v":0},{"$f":"+'[1]a1_1 ind'!Z3","v":"BARRANQUILLA"},{"$f":"+'[1]a1_1 ind'!AA3","v":"BOGOTA"},{"$f":"+'[1]a1_1 ind'!AB3","v":"CALI"},{"$f":"+'[1]a1_1 ind'!AC3","v":"MEDELLIN"},{"$f":"+'[1]a1_1 ind'!AD3","v":"RESTO"},{"$f":"+'[1]a1_1 ind'!AE3","v":"TOTAL"},"Espectadores"]
[null,{"$f":"PROPER(B2)","v":"Barranquilla"},{"$f":"PROPER(C2)","v":"Bogota"},"Cali","Medellin","Resto","Total"]
[{"$f":"+'[1]a1_1 ind'!Y4","v":2007},{"$f":"+'[1]a1_1 ind'!Z4","v":929241},{"$f":"+'[1]a1_1 ind'!AA4","v":9493415},{"$f":"+'[1]a1_1 ind'!AB4","v":2165068},{"$f":"+'[1]a1_1 ind'!AC4","v":2748120},{"$f":"+'[1]a1_1 ind'!AD4","v":5333114},{"$f":"+'[1]a1_1 ind'!AE4","v":20668958}]
[{"$f":"+'[1]a1_1 ind'!Y5","v":2008},{"$f":"+'[1]a1_1 ind'!Z5","v":1128151},{"$f":"+'[1]a1_1 ind'!AA5","v":9594614},{"$f":"+'[1]a1_1 ind'!AB5","v":2129496},{"$f":"+'[1]a1_1 ind'!AC5","v":2836603},{"$f":"+'[1]a1_1 ind'!AD5","v":5874013},{"$f":"+'[1]a1_1 ind'!AE5","v":21562877}]
[{"$f":"+'[1]a1_1 ind'!Y6","v":2009},{"$f":"+'[1]a1_1 ind'!Z6","v":1256435},{"$f":"+'[1]a1_1 ind'!AA6","v":12465304},{"$f":"+'[1]a1_1 ind'!AB6","v":2325329},{"$f":"+'[1]a1_1 ind'!AC6","v":3156460},{"$f":"+'[1]a1_1 ind'!AD6","v":7864157},{"$f":"+'[1]a1_1 ind'!AE6","v":27067685}]
[{"$f":"+'[1]a1_1 ind'!Y7","v":2010},{"$f":"+'[1]a1_1 ind'!Z7","v":1472241},{"$f":"+'[1]a1_1 ind'!AA7","v":14907415},{"$f":"+'[1]a1_1 ind'!AB7","v":3338962},{"$f":"+'[1]a1_1 ind'!AC7","v":3594476},{"$f":"+'[1]a1_1 ind'!AD7","v":10341997},{"$f":"+'[1]a1_1 ind'!AE7","v":33655091}]
[{"$f":"+'[1]a1_1 ind'!Y8","v":"2010*"},{"$f":"+'[1]a1_1 ind'!Z8","v":711428},{"$f":"+'[1]a1_1 ind'!AA8","v":7588803},{"$f":"+'[1]a1_1 ind'!AB8","v":1586129},{"$f":"+'[1]a1_1 ind'!AC8","v":1826926},{"$f":"+'[1]a1_1 ind'!AD8","v":4926414},{"$f":"+'[1]a1_1 ind'!AE8","v":16639700}]
[{"$f":"+'[1]a1_1 ind'!Y9","v":"2011*"},{"$f":"+'[1]a1_1 ind'!Z9","v":818750},{"$f":"+'[1]a1_1 ind'!AA9","v":8171870},{"$f":"+'[1]a1_1 ind'!AB9","v":1936524},{"$f":"+'[1]a1_1 ind'!AC9","v":1989817},{"$f":"+'[1]a1_1 ind'!AD9","v":6130932},{"$f":"+'[1]a1_1 ind'!AE9","v":19047893}]
[]
[null,null,{"$f":"+C4/G4*100","v":45.930786641493974},null,null,null,"Asistencia a cine en las principales ciudades"]
[null,null,{"$f":"+C5/G5*100","v":44.495982609370728},null,null,null,"2007 - 2011*"]
[null,null,46.05234618328091]
[null,null,44.294680409570134]
[null,null,45.606609494161553]
[null,null,42.901700466293043]
[]
[]
[]
[]
[null,"Barranquilla","Cali","Medellín","Resto","Bogotá","Total"]
[2007,929241,2165068,2748120,5333114,9493415,20668958]
[2008,1128151,2129496,2836603,5874013,9594614,21562877]
[2009,1256435,2325329,3156460,7864157,12465304,27067685]
[2010,1472241,3338962,3594476,10341997,14907415,33655091]
["2010*",711428,1586129,1826926,4926414,7588803,16639700]
["2011*",818750,1936524,1989817,6130932,8171870,19047893]
[]
[]
[]
[]
[]
[]
[]
[]
[]
[]
[]
[]
[]
[]
[]
[]
[]
[]
[]
[]
[]
[]
[]
[]
[]
[]
[]
[]
[]
[null,null,null,null,null,null,null,null,"Espectadores 2011*"]

{"sheet":"Evo. prom boleta en Col.","index":17,"n_rows":40,"n_cols":21,"rows_kept":40,"cut":false,"hidden":false,"merged":[]}
[null,{"$f":"+[1]a2_ind!AH1","v":"Precio promedio"},null,null,null,null,null,{"$f":"+[1]a2_ind!AN1","v":"Precio real boleta"},null,null,null,"Gráfico 8"]
[null,{"$f":"+[1]a2_ind!AH2","v":"COP$"},{"$f":"+[1]a2_ind!AI2","v":"USD$"},null,null,null,null,{"$f":"+[1]a2_ind!AN2","v":"COP$ (Base junio 2011)"},null,null,null,"Evolución real del precio promedio de la boleta en Colombia",null,null,null,null,null,null,null,null,"Precio real en pesos"]
[{"$f":"+[1]a2_ind!AG3","v":1990},{"$f":"+[1]a2_ind!AH3","v":423.14393939393938},{"$f":"+[1]a2_ind!AI3","v":0.84247986977648914},null,null,null,{"$f":"+[1]a2_ind!AM3","v":1990},{"$f":"+[1]a2_ind!AN3","v":4682.7929292929293},null,null,null,"1996 - 2011*"]
[{"$f":"+[1]a2_ind!AG4","v":1991},{"$f":"+[1]a2_ind!AH4","v":574.44444444444446},{"$f":"+[1]a2_ind!AI4","v":0.91595655672973386},null,null,null,{"$f":"+[1]a2_ind!AM4","v":1991},{"$f":"+[1]a2_ind!AN4","v":4849.9652234394025}]
[{"$f":"+[1]a2_ind!AG5","v":1992},{"$f":"+[1]a2_ind!AH5","v":772.40641711229944},{"$f":"+[1]a2_ind!AI5","v":1.1352476481295042},null,null,null,{"$f":"+[1]a2_ind!AM5","v":1992},{"$f":"+[1]a2_ind!AN5","v":5091.1821873193103}]
[{"$f":"+[1]a2_ind!AG6","v":1993},{"$f":"+[1]a2_ind!AH6","v":1140.7386363636363},{"$f":"+[1]a2_ind!AI6","v":1.4506815946702509},null,null,null,{"$f":"+[1]a2_ind!AM6","v":1993},{"$f":"+[1]a2_ind!AN6","v":6194.5495150295092}]
[{"$f":"+[1]a2_ind!AG7","v":1994},{"$f":"+[1]a2_ind!AH7","v":1621.9428571428571},{"$f":"+[1]a2_ind!AI7","v":1.9623283291103359},null,null,null,{"$f":"+[1]a2_ind!AM7","v":1994},{"$f":"+[1]a2_ind!AN7","v":7154.8501343301014}]
[{"$f":"+[1]a2_ind!AG8","v":1995},{"$f":"+[1]a2_ind!AH8","v":1918.2857142857142},{"$f":"+[1]a2_ind!AI8","v":2.1013213067063727},null,null,null,{"$f":"+[1]a2_ind!AM8","v":1995},{"$f":"+[1]a2_ind!AN8","v":6955.074884792627}]
[{"$f":"+[1]a2_ind!AG9","v":1996},{"$f":"+[1]a2_ind!AH9","v":2326.5373961218838},{"$f":"+[1]a2_ind!AI9","v":2.2443439112327614},null,null,null,{"$f":"+[1]a2_ind!AM9","v":1996},{"$f":"+[1]a2_ind!AN9","v":7047.5402875224954}]
[{"$f":"+[1]a2_ind!AG10","v":1997},{"$f":"+[1]a2_ind!AH10","v":3007.8431372549021},{"$f":"+[1]a2_ind!AI10","v":2.6358769660609362},null,null,null,{"$f":"+[1]a2_ind!AM10","v":1997},{"$f":"+[1]a2_ind!AN10","v":7676.1181293709551}]
[{"$f":"+[1]a2_ind!AG11","v":1998},{"$f":"+[1]a2_ind!AH11","v":3400.108991825613},{"$f":"+[1]a2_ind!AI11","v":2.3836591325924767},null,null,null,{"$f":"+[1]a2_ind!AM11","v":1998},{"$f":"+[1]a2_ind!AN11","v":7189.3349053102811}]
[{"$f":"+[1]a2_ind!AG12","v":1999},{"$f":"+[1]a2_ind!AH12","v":3913.4459036898061},{"$f":"+[1]a2_ind!AI12","v":2.2277437601144618},null,null,null,{"$f":"+[1]a2_ind!AM12","v":1999},{"$f":"+[1]a2_ind!AN12","v":7594.618938995146}]
[{"$f":"+[1]a2_ind!AG13","v":2000},{"$f":"+[1]a2_ind!AH13","v":4404.9418604651164},{"$f":"+[1]a2_ind!AI13","v":2.1097290014368935},null,null,null,{"$f":"+[1]a2_ind!AM13","v":2000},{"$f":"+[1]a2_ind!AN13","v":7794.2477327678935}]
[{"$f":"+[1]a2_ind!AG14","v":2001},{"$f":"+[1]a2_ind!AH14","v":5181.2563209349364},{"$f":"+[1]a2_ind!AI14","v":2.2528246183598086},null,null,null,{"$f":"+[1]a2_ind!AM14","v":2001},{"$f":"+[1]a2_ind!AN14","v":8493.7337743676653}]
[{"$f":"+[1]a2_ind!AG15","v":2002},{"$f":"+[1]a2_ind!AH15","v":6059.1336485678567},{"$f":"+[1]a2_ind!AI15","v":2.4191240528255689},null,null,null,{"$f":"+[1]a2_ind!AM15","v":2002},{"$f":"+[1]a2_ind!AN15","v":9349.0707948015406}]
[{"$f":"+[1]a2_ind!AG16","v":2003},{"$f":"+[1]a2_ind!AH16","v":6682.839751843615},{"$f":"+[1]a2_ind!AI16","v":2.3224115079102021},null,null,null,{"$f":"+[1]a2_ind!AM16","v":2003},{"$f":"+[1]a2_ind!AN16","v":9618.2260800843815}]
[{"$f":"+[1]a2_ind!AG17","v":2004},{"$f":"+[1]a2_ind!AH17","v":7456.6639411283732},{"$f":"+[1]a2_ind!AI17","v":2.8369935242948725},null,null,null,{"$f":"+[1]a2_ind!AM17","v":2004},{"$f":"+[1]a2_ind!AN17","v":10117.882787320819}]
[{"$f":"+[1]a2_ind!AG18","v":2005},{"$f":"+[1]a2_ind!AH18","v":7596.9259723964869},{"$f":"+[1]a2_ind!AI18","v":3.272940558045244},null,null,null,{"$f":"+[1]a2_ind!AM18","v":2005},{"$f":"+[1]a2_ind!AN18","v":9833.3530760746289}]
[{"$f":"+[1]a2_ind!AG19","v":2006},{"$f":"+[1]a2_ind!AH19","v":6847.4374591116002},{"$f":"+[1]a2_ind!AI19","v":2.9031849296346346},null,null,null,{"$f":"+[1]a2_ind!AM19","v":2006},{"$f":"+[1]a2_ind!AN19","v":8527.6835392213961}]
[{"$f":"+[1]a2_ind!AG20","v":2007},{"$f":"+[1]a2_ind!AH20","v":7194.1674793221127},{"$f":"+[1]a2_ind!AI20","v":3.4623784629040801},null,null,null,{"$f":"+[1]a2_ind!AM20","v":2007},{"$f":"+[1]a2_ind!AN20","v":8449.4467292789377}]
[{"$f":"+[1]a2_ind!AG21","v":2008},{"$f":"+[1]a2_ind!AH21","v":7418.7587059327179},{"$f":"+[1]a2_ind!AI21","v":3.775185556192743},null,null,null,{"$f":"+[1]a2_ind!AM21","v":2008},{"$f":"+[1]a2_ind!AN21","v":8129.2176741153689}]
[{"$f":"+[1]a2_ind!AG22","v":2009},{"$f":"+[1]a2_ind!AH22","v":7317.8993654980095},{"$f":"+[1]a2_ind!AI22","v":3.3916875316604385},null,null,null,{"$f":"+[1]a2_ind!AM22","v":2009},{"$f":"+[1]a2_ind!AN22","v":7724.5288743615274}]
[{"$f":"+[1]a2_ind!AG23","v":2010},{"$f":"+[1]a2_ind!AH23","v":7668.5339745726624},{"$f":"+[1]a2_ind!AI23","v":4.0382011954058186},null,null,null,{"$f":"+[1]a2_ind!AM23","v":2010},{"$f":"+[1]a2_ind!AN23","v":7916.5213916608336}]
[{"$f":"+[1]a2_ind!AG24","v":"2011*"},{"$f":"+[1]a2_ind!AH24","v":7805.9532596597428},{"$f":"+[1]a2_ind!AI24","v":4.2459849888318262},null,null,null,{"$f":"+[1]a2_ind!AM24","v":"2011*"},{"$f":"+[1]a2_ind!AN24","v":7805.9532596597428}]
[]
[null,null,null,null,null,null,null,{"$f":"+H17/H3","v":2.1606513335298283}]
[null,null,null,null,null,null,null,{"$f":"+H24*100/H17-100","v":-22.849933886941855}]
[]
[null,null,null,null,null,null,null,{"$f":"+H17-H24","v":2311.9295276610765}]
[]
[]
[]
[]
[]
[]
[]
[]
[]
[]
[null,null,null,null,null,null,null,{"$f":"+H17/H9","v":1.4356615747531509}]

{"sheet":"Evo. prom boleta por Ciudad","index":18,"n_rows":79,"n_cols":10,"rows_kept":79,"cut":false,"hidden":false,"merged":[]}
[{"$f":"+[1]a2_1ind!AC3","v":"PRECIO PESOS TERMINOS REALES"}]
[{"$f":"+[1]a2_1ind!AC4","v":"Fecha"},{"$f":"+[1]a2_1ind!AD4","v":"BARRANQUILLA"},{"$f":"+[1]a2_1ind!AE4","v":"BOGOTA"},{"$f":"+[1]a2_1ind!AF4","v":"CALI"},{"$f":"+[1]a2_1ind!AG4","v":"MEDELLIN"},{"$f":"+[1]a2_1ind!AH4","v":"RESTO"},{"$f":"+[1]a2_1ind!AI4","v":"NACIONAL"}]
[null,{"$f":"+PROPER((B2))","v":"Barranquilla"},{"$f":"+PROPER((C2))","v":"Bogota"},"Cali","Medellin","Resto","Nacional"]
[{"$f":"+[1]a2_1ind!AC5","v":"2006-09-01"},{"$f":"+[1]a2_1ind!AD5","v":8303.7117129722228},{"$f":"+[1]a2_1ind!AE5","v":8862.9674013734184},{"$f":"+[1]a2_1ind!AF5","v":9240.4535614956767},{"$f":"+[1]a2_1ind!AG5","v":8464.7943881799001},{"$f":"+[1]a2_1ind!AH5","v":7198.83032853236},{"$f":"+[1]a2_1ind!AI5","v":8407.6107853158355}]
[{"$f":"+[1]a2_1ind!AC6","v":"2006-10-01"},{"$f":"+[1]a2_1ind!AD6","v":6265.2319732533542},{"$f":"+[1]a2_1ind!AE6","v":6726.142734584384},{"$f":"+[1]a2_1ind!AF6","v":6774.2632034241606},{"$f":"+[1]a2_1ind!AG6","v":6510.4761678087943},{"$f":"+[1]a2_1ind!AH6","v":5999.3659149082168},{"$f":"+[1]a2_1ind!AI6","v":6506.4888378834348}]
[{"$f":"+[1]a2_1ind!AC7","v":"2006-11-01"},{"$f":"+[1]a2_1ind!AD7","v":8302.6291160405181},{"$f":"+[1]a2_1ind!AE7","v":8997.1320678555167},{"$f":"+[1]a2_1ind!AF7","v":9313.8230169371964},{"$f":"+[1]a2_1ind!AG7","v":8616.5694203258481},{"$f":"+[1]a2_1ind!AH7","v":7463.7732564896287},{"$f":"+[1]a2_1ind!AI7","v":8605.7991899006411}]
[{"$f":"+[1]a2_1ind!AC8","v":"2006-12-01"},{"$f":"+[1]a2_1ind!AD8","v":8126.8879309006015},{"$f":"+[1]a2_1ind!AE8","v":8825.5028590031179},{"$f":"+[1]a2_1ind!AF8","v":9340.3220176607101},{"$f":"+[1]a2_1ind!AG8","v":8375.5402834950819},{"$f":"+[1]a2_1ind!AH8","v":7437.43413315},{"$f":"+[1]a2_1ind!AI8","v":8418.4720500787407}]
[{"$f":"+[1]a2_1ind!AC9","v":"2007-01-01"},{"$f":"+[1]a2_1ind!AD9","v":8457.4038996810559},{"$f":"+[1]a2_1ind!AE9","v":9135.7754326731283},{"$f":"+[1]a2_1ind!AF9","v":9824.8772248891419},{"$f":"+[1]a2_1ind!AG9","v":8622.1371979448413},{"$f":"+[1]a2_1ind!AH9","v":8027.3186614359329},{"$f":"+[1]a2_1ind!AI9","v":8834.7221764828155}]
[{"$f":"+[1]a2_1ind!AC10","v":"2007-02-01"},{"$f":"+[1]a2_1ind!AD10","v":8817.7640150243024},{"$f":"+[1]a2_1ind!AE10","v":9509.7481436086491},{"$f":"+[1]a2_1ind!AF10","v":9768.9532174064752},{"$f":"+[1]a2_1ind!AG10","v":8842.0508566724147},{"$f":"+[1]a2_1ind!AH10","v":7904.9211892253934},{"$f":"+[1]a2_1ind!AI10","v":9070.5902816323887}]
[{"$f":"+[1]a2_1ind!AC11","v":"2007-03-01"},{"$f":"+[1]a2_1ind!AD11","v":8906.0453807578633},{"$f":"+[1]a2_1ind!AE11","v":9363.8284646095435},{"$f":"+[1]a2_1ind!AF11","v":9665.0983671533686},{"$f":"+[1]a2_1ind!AG11","v":8740.5365227229613},{"$f":"+[1]a2_1ind!AH11","v":7946.6379308461783},{"$f":"+[1]a2_1ind!AI11","v":8979.1286862777615}]
[{"$f":"+[1]a2_1ind!AC12","v":"2007-04-01"},{"$f":"+[1]a2_1ind!AD12","v":8373.344578552349},{"$f":"+[1]a2_1ind!AE12","v":8705.6015084258888},{"$f":"+[1]a2_1ind!AF12","v":9207.3840963790335},{"$f":"+[1]a2_1ind!AG12","v":8389.4401336884184},{"$f":"+[1]a2_1ind!AH12","v":7645.8259615046409},{"$f":"+[1]a2_1ind!AI12","v":8446.2580195370465}]
[{"$f":"+[1]a2_1ind!AC13","v":"2007-05-01"},{"$f":"+[1]a2_1ind!AD13","v":8556.0392067131615},{"$f":"+[1]a2_1ind!AE13","v":8857.5779518644504},{"$f":"+[1]a2_1ind!AF13","v":9328.5720854753308},{"$f":"+[1]a2_1ind!AG13","v":8483.7901022512051},{"$f":"+[1]a2_1ind!AH13","v":7592.3159314641416},{"$f":"+[1]a2_1ind!AI13","v":8489.5869988348404}]
[{"$f":"+[1]a2_1ind!AC14","v":"2007-06-01"},{"$f":"+[1]a2_1ind!AD14","v":8317.2367535974245},{"$f":"+[1]a2_1ind!AE14","v":8753.6367490679422},{"$f":"+[1]a2_1ind!AF14","v":9200.3432987942979},{"$f":"+[1]a2_1ind!AG14","v":8351.6958063192596},{"$f":"+[1]a2_1ind!AH14","v":7659.8749531227822},{"$f":"+[1]a2_1ind!AI14","v":8453.0931777032929}]
[{"$f":"+[1]a2_1ind!AC15","v":"2007-07-01"},{"$f":"+[1]a2_1ind!AD15","v":8195.0154137023474},{"$f":"+[1]a2_1ind!AE15","v":8705.0286906778692},{"$f":"+[1]a2_1ind!AF15","v":9060.7834602079183},{"$f":"+[1]a2_1ind!AG15","v":8331.277197850015},{"$f":"+[1]a2_1ind!AH15","v":7525.99051648363},{"$f":"+[1]a2_1ind!AI15","v":8362.958598997815}]
[{"$f":"+[1]a2_1ind!AC16","v":"2007-08-01"},{"$f":"+[1]a2_1ind!AD16","v":8345.3651853352185},{"$f":"+[1]a2_1ind!AE16","v":8988.408566440974},{"$f":"+[1]a2_1ind!AF16","v":9023.5254249131012},{"$f":"+[1]a2_1ind!AG16","v":8482.2041055790796},{"$f":"+[1]a2_1ind!AH16","v":7663.9548897321229},{"$f":"+[1]a2_1ind!AI16","v":8533.9849889469624}]
[{"$f":"+[1]a2_1ind!AC17","v":"2007-09-01"},{"$f":"+[1]a2_1ind!AD17","v":8329.7827380436629},{"$f":"+[1]a2_1ind!AE17","v":8863.7028579536473},{"$f":"+[1]a2_1ind!AF17","v":8824.7832059785778},{"$f":"+[1]a2_1ind!AG17","v":8436.9742648450792},{"$f":"+[1]a2_1ind!AH17","v":7613.5586617686859},{"$f":"+[1]a2_1ind!AI17","v":8457.8490275385175}]
[{"$f":"+[1]a2_1ind!AC18","v":"2007-10-01"},{"$f":"+[1]a2_1ind!AD18","v":6906.9439329771358},{"$f":"+[1]a2_1ind!AE18","v":7196.725876407444},{"$f":"+[1]a2_1ind!AF18","v":7054.2173929597175},{"$f":"+[1]a2_1ind!AG18","v":7060.3577703209648},{"$f":"+[1]a2_1ind!AH18","v":6370.0847227256872},{"$f":"+[1]a2_1ind!AI18","v":6946.8190304591399}]
[{"$f":"+[1]a2_1ind!AC19","v":"2007-11-01"},{"$f":"+[1]a2_1ind!AD19","v":8384.9736243338448},{"$f":"+[1]a2_1ind!AE19","v":9081.4763845166508},{"$f":"+[1]a2_1ind!AF19","v":8819.6318256824161},{"$f":"+[1]a2_1ind!AG19","v":8824.9976065052415},{"$f":"+[1]a2_1ind!AH19","v":7887.3994967068247},{"$f":"+[1]a2_1ind!AI19","v":8668.5213124131478}]
[{"$f":"+[1]a2_1ind!AC20","v":"2007-12-01"},{"$f":"+[1]a2_1ind!AD20","v":8152.1406315453023},{"$f":"+[1]a2_1ind!AE20","v":8924.5955904790098},{"$f":"+[1]a2_1ind!AF20","v":9072.4730402558998},{"$f":"+[1]a2_1ind!AG20","v":8513.8041404186715},{"$f":"+[1]a2_1ind!AH20","v":7846.6459023276038},{"$f":"+[1]a2_1ind!AI20","v":8524.1508882297603}]
[{"$f":"+[1]a2_1ind!AC21","v":"2008-01-01"},{"$f":"+[1]a2_1ind!AD21","v":7772.9279626250336},{"$f":"+[1]a2_1ind!AE21","v":9058.3351286807138},{"$f":"+[1]a2_1ind!AF21","v":9486.1582824533652},{"$f":"+[1]a2_1ind!AG21","v":8323.6884934501995},{"$f":"+[1]a2_1ind!AH21","v":7924.056297099165},{"$f":"+[1]a2_1ind!AI21","v":8629.446978538801}]
[{"$f":"+[1]a2_1ind!AC22","v":"2008-02-01"},{"$f":"+[1]a2_1ind!AD22","v":7587.8485904800445},{"$f":"+[1]a2_1ind!AE22","v":9134.813422989595},{"$f":"+[1]a2_1ind!AF22","v":9326.5296829696472},{"$f":"+[1]a2_1ind!AG22","v":8206.1813619835157},{"$f":"+[1]a2_1ind!AH22","v":7657.6483735589636},{"$f":"+[1]a2_1ind!AI22","v":8574.6292867029824}]
[{"$f":"+[1]a2_1ind!AC23","v":"2008-03-01"},{"$f":"+[1]a2_1ind!AD23","v":7538.5524976617808},{"$f":"+[1]a2_1ind!AE23","v":8944.3974256595775},{"$f":"+[1]a2_1ind!AF23","v":9168.9534189813621},{"$f":"+[1]a2_1ind!AG23","v":8310.8512100581793},{"$f":"+[1]a2_1ind!AH23","v":7814.4757287451712},{"$f":"+[1]a2_1ind!AI23","v":8515.6311935761096}]
[{"$f":"+[1]a2_1ind!AC24","v":"2008-04-01"},{"$f":"+[1]a2_1ind!AD24","v":7271.86868816484},{"$f":"+[1]a2_1ind!AE24","v":8505.9607739377861},{"$f":"+[1]a2_1ind!AF24","v":8830.7169811143776},{"$f":"+[1]a2_1ind!AG24","v":8110.8303614015258},{"$f":"+[1]a2_1ind!AH24","v":7481.0262954251502},{"$f":"+[1]a2_1ind!AI24","v":8179.435336239776}]
[{"$f":"+[1]a2_1ind!AC25","v":"2008-05-01"},{"$f":"+[1]a2_1ind!AD25","v":7530.5773916303042},{"$f":"+[1]a2_1ind!AE25","v":8937.2204267182042},{"$f":"+[1]a2_1ind!AF25","v":9097.5314660242148},{"$f":"+[1]a2_1ind!AG25","v":8268.0320052780098},{"$f":"+[1]a2_1ind!AH25","v":7810.4358968025472},{"$f":"+[1]a2_1ind!AI25","v":8496.9016774804168}]
[{"$f":"+[1]a2_1ind!AC26","v":"2008-06-01"},{"$f":"+[1]a2_1ind!AD26","v":7347.3376379134743},{"$f":"+[1]a2_1ind!AE26","v":8487.5458551387437},{"$f":"+[1]a2_1ind!AF26","v":8834.041351832464},{"$f":"+[1]a2_1ind!AG26","v":7914.5976871414268},{"$f":"+[1]a2_1ind!AH26","v":7523.5884447098279},{"$f":"+[1]a2_1ind!AI26","v":8122.5752057945056}]
[{"$f":"+[1]a2_1ind!AC27","v":"2008-07-01"},{"$f":"+[1]a2_1ind!AD27","v":7300.775175994323},{"$f":"+[1]a2_1ind!AE27","v":8260.2407522996946},{"$f":"+[1]a2_1ind!AF27","v":8474.9986699934725},{"$f":"+[1]a2_1ind!AG27","v":7838.8031477749046},{"$f":"+[1]a2_1ind!AH27","v":7212.3347832102982},{"$f":"+[1]a2_1ind!AI27","v":7881.5532938658871}]
[{"$f":"+[1]a2_1ind!AC28","v":"2008-08-01"},{"$f":"+[1]a2_1ind!AD28","v":7453.8724489670676},{"$f":"+[1]a2_1ind!AE28","v":8401.7536201329076},{"$f":"+[1]a2_1ind!AF28","v":8783.6627497594563},{"$f":"+[1]a2_1ind!AG28","v":7929.8308019393144},{"$f":"+[1]a2_1ind!AH28","v":7398.7455171395168},{"$f":"+[1]a2_1ind!AI28","v":8052.9203986227567}]
[{"$f":"+[1]a2_1ind!AC29","v":"2008-09-01"},{"$f":"+[1]a2_1ind!AD29","v":7406.3831205647548},{"$f":"+[1]a2_1ind!AE29","v":8429.0314740916383},{"$f":"+[1]a2_1ind!AF29","v":8859.5976280944324},{"$f":"+[1]a2_1ind!AG29","v":7819.3601452684597},{"$f":"+[1]a2_1ind!AH29","v":7305.8171226325221},{"$f":"+[1]a2_1ind!AI29","v":8029.1105784736283},null,null,"Evolución real del precio promedio de la boleta por ciudad"]
[{"$f":"+[1]a2_1ind!AC30","v":"2008-10-01"},{"$f":"+[1]a2_1ind!AD30","v":7251.1152177910408},{"$f":"+[1]a2_1ind!AE30","v":8398.8283602182437},{"$f":"+[1]a2_1ind!AF30","v":8669.4339860141954},{"$f":"+[1]a2_1ind!AG30","v":7356.0079385825138},{"$f":"+[1]a2_1ind!AH30","v":6672.8515791436103},{"$f":"+[1]a2_1ind!AI30","v":7729.9481277221821}]
[{"$f":"+[1]a2_1ind!AC31","v":"2008-11-01"},{"$f":"+[1]a2_1ind!AD31","v":7536.9021388780184},{"$f":"+[1]a2_1ind!AE31","v":8267.2774506343503},{"$f":"+[1]a2_1ind!AF31","v":8871.8814358209129},{"$f":"+[1]a2_1ind!AG31","v":7734.3683440536124},{"$f":"+[1]a2_1ind!AH31","v":7237.3700433716576},{"$f":"+[1]a2_1ind!AI31","v":7935.5827302075922}]
[{"$f":"+[1]a2_1ind!AC32","v":"2008-12-01"},{"$f":"+[1]a2_1ind!AD32","v":7612.7764869359216},{"$f":"+[1]a2_1ind!AE32","v":8502.9756083331322},{"$f":"+[1]a2_1ind!AF32","v":9182.0075480646719},{"$f":"+[1]a2_1ind!AG32","v":8143.7908002797822},{"$f":"+[1]a2_1ind!AH32","v":7387.1620760559372},{"$f":"+[1]a2_1ind!AI32","v":8125.2661546865702}]
[{"$f":"+[1]a2_1ind!AC33","v":"2009-01-01"},{"$f":"+[1]a2_1ind!AD33","v":7860.3267720449358},{"$f":"+[1]a2_1ind!AE33","v":9072.3148205813741},{"$f":"+[1]a2_1ind!AF33","v":9858.9393341379273},{"$f":"+[1]a2_1ind!AG33","v":8461.1797873349406},{"$f":"+[1]a2_1ind!AH33","v":7492.8634134349595},{"$f":"+[1]a2_1ind!AI33","v":8560.2059693393221}]
[{"$f":"+[1]a2_1ind!AC34","v":"2009-02-01"},{"$f":"+[1]a2_1ind!AD34","v":7792.1771158755009},{"$f":"+[1]a2_1ind!AE34","v":8921.7191907352717},{"$f":"+[1]a2_1ind!AF34","v":9614.7987168254203},{"$f":"+[1]a2_1ind!AG34","v":8227.3023568888511},{"$f":"+[1]a2_1ind!AH34","v":7225.7486126921112},{"$f":"+[1]a2_1ind!AI34","v":8406.0841776950547}]
[{"$f":"+[1]a2_1ind!AC35","v":"2009-03-01"},{"$f":"+[1]a2_1ind!AD35","v":7811.7061760493525},{"$f":"+[1]a2_1ind!AE35","v":8450.9468768391835},{"$f":"+[1]a2_1ind!AF35","v":9542.3769985771251},{"$f":"+[1]a2_1ind!AG35","v":8049.4172959389061},{"$f":"+[1]a2_1ind!AH35","v":7145.1712053292977},{"$f":"+[1]a2_1ind!AI35","v":8137.2714716484943}]
[{"$f":"+[1]a2_1ind!AC36","v":"2009-04-01"},{"$f":"+[1]a2_1ind!AD36","v":6715.5913537728184},{"$f":"+[1]a2_1ind!AE36","v":8313.7704972230076},{"$f":"+[1]a2_1ind!AF36","v":9070.4410523533479},{"$f":"+[1]a2_1ind!AG36","v":7866.1271493448903},{"$f":"+[1]a2_1ind!AH36","v":6960.9507418848016},{"$f":"+[1]a2_1ind!AI36","v":7861.8276328965549}]
[{"$f":"+[1]a2_1ind!AC37","v":"2009-05-01"},{"$f":"+[1]a2_1ind!AD37","v":7346.1706747485332},{"$f":"+[1]a2_1ind!AE37","v":8123.1232091917846},{"$f":"+[1]a2_1ind!AF37","v":9091.0761778426786},{"$f":"+[1]a2_1ind!AG37","v":7814.8423247619548},{"$f":"+[1]a2_1ind!AH37","v":6837.337640795171},{"$f":"+[1]a2_1ind!AI37","v":7760.487224210091}]
[{"$f":"+[1]a2_1ind!AC38","v":"2009-06-01"},{"$f":"+[1]a2_1ind!AD38","v":7527.883598557597},{"$f":"+[1]a2_1ind!AE38","v":8375.0312457299297},{"$f":"+[1]a2_1ind!AF38","v":9549.2236330426331},{"$f":"+[1]a2_1ind!AG38","v":8376.6229191851689},{"$f":"+[1]a2_1ind!AH38","v":6910.6138036551065},{"$f":"+[1]a2_1ind!AI38","v":8005.7318201907556}]
[{"$f":"+[1]a2_1ind!AC39","v":"2009-07-01"},{"$f":"+[1]a2_1ind!AD39","v":7507.9431533695779},{"$f":"+[1]a2_1ind!AE39","v":8207.7719533373474},{"$f":"+[1]a2_1ind!AF39","v":9257.9227803819686},{"$f":"+[1]a2_1ind!AG39","v":8662.9521534787054},{"$f":"+[1]a2_1ind!AH39","v":6811.6865049752732},{"$f":"+[1]a2_1ind!AI39","v":7910.0135049416685}]
[{"$f":"+[1]a2_1ind!AC40","v":"2009-08-01"},{"$f":"+[1]a2_1ind!AD40","v":7708.7613102455753},{"$f":"+[1]a2_1ind!AE40","v":8215.691885033566},{"$f":"+[1]a2_1ind!AF40","v":9418.5293881108901},{"$f":"+[1]a2_1ind!AG40","v":8578.1041371952178},{"$f":"+[1]a2_1ind!AH40","v":6862.0850541827958},{"$f":"+[1]a2_1ind!AI40","v":7968.5901802758663}]
[{"$f":"+[1]a2_1ind!AC41","v":"2009-09-01"},{"$f":"+[1]a2_1ind!AD41","v":7352.4900328089943},{"$f":"+[1]a2_1ind!AE41","v":7759.8736453239135},{"$f":"+[1]a2_1ind!AF41","v":9191.913395715459},{"$f":"+[1]a2_1ind!AG41","v":8258.6159486473261},{"$f":"+[1]a2_1ind!AH41","v":6367.1961929813679},{"$f":"+[1]a2_1ind!AI41","v":7517.7721395237058}]
[{"$f":"+[1]a2_1ind!AC42","v":"2009-10-01"},{"$f":"+[1]a2_1ind!AD42","v":7602.831991708742},{"$f":"+[1]a2_1ind!AE42","v":7463.6281933949285},{"$f":"+[1]a2_1ind!AF42","v":9454.0632162616366},{"$f":"+[1]a2_1ind!AG42","v":8283.1646903923647},{"$f":"+[1]a2_1ind!AH42","v":5916.3372318339998},{"$f":"+[1]a2_1ind!AI42","v":7237.6330315040505}]
[{"$f":"+[1]a2_1ind!AC43","v":"2009-11-01"},{"$f":"+[1]a2_1ind!AD43","v":7255.1126714501997},{"$f":"+[1]a2_1ind!AE43","v":6817.6589901999514},{"$f":"+[1]a2_1ind!AF43","v":9009.1788808888832},{"$f":"+[1]a2_1ind!AG43","v":7960.6760070262781},{"$f":"+[1]a2_1ind!AH43","v":5572.3233725733135},{"$f":"+[1]a2_1ind!AI43","v":6739.3957291932902}]
[{"$f":"+[1]a2_1ind!AC44","v":"2009-12-01"},{"$f":"+[1]a2_1ind!AD44","v":7966.2194577862801},{"$f":"+[1]a2_1ind!AE44","v":7484.9683137801867},{"$f":"+[1]a2_1ind!AF44","v":9037.575809159207},{"$f":"+[1]a2_1ind!AG44","v":8668.2441682179051},{"$f":"+[1]a2_1ind!AH44","v":5857.6609278831202},{"$f":"+[1]a2_1ind!AI44","v":7223.8326151554211}]
[{"$f":"+[1]a2_1ind!AC45","v":"2010-01-01"},{"$f":"+[1]a2_1ind!AD45","v":8341.9232688983411},{"$f":"+[1]a2_1ind!AE45","v":8050.6869514531181},{"$f":"+[1]a2_1ind!AF45","v":9024.6363330633176},{"$f":"+[1]a2_1ind!AG45","v":9275.8274568220841},{"$f":"+[1]a2_1ind!AH45","v":6332.2795033550155},{"$f":"+[1]a2_1ind!AI45","v":7791.6178277441177}]
[{"$f":"+[1]a2_1ind!AC46","v":"2010-02-01"},{"$f":"+[1]a2_1ind!AD46","v":8223.7949650530518},{"$f":"+[1]a2_1ind!AE46","v":8226.9647567224383},{"$f":"+[1]a2_1ind!AF46","v":8533.2919785026697},{"$f":"+[1]a2_1ind!AG46","v":9419.8432945744644},{"$f":"+[1]a2_1ind!AH46","v":6197.9150862737588},{"$f":"+[1]a2_1ind!AI46","v":7835.50607113346}]
[{"$f":"+[1]a2_1ind!AC47","v":"2010-03-01"},{"$f":"+[1]a2_1ind!AD47","v":8653.7755780920379},{"$f":"+[1]a2_1ind!AE47","v":8580.6897591868474},{"$f":"+[1]a2_1ind!AF47","v":9147.4753507241385},{"$f":"+[1]a2_1ind!AG47","v":9396.6374683518879},{"$f":"+[1]a2_1ind!AH47","v":6324.7988496964817},{"$f":"+[1]a2_1ind!AI47","v":8099.7909567429897}]
[{"$f":"+[1]a2_1ind!AC48","v":"2010-04-01"},{"$f":"+[1]a2_1ind!AD48","v":8175.0969382174835},{"$f":"+[1]a2_1ind!AE48","v":8661.6047441561459},{"$f":"+[1]a2_1ind!AF48","v":8871.6126320897802},{"$f":"+[1]a2_1ind!AG48","v":9217.6595385189394},{"$f":"+[1]a2_1ind!AH48","v":6258.8535003808183},{"$f":"+[1]a2_1ind!AI48","v":7992.1405842759532}]
[{"$f":"+[1]a2_1ind!AC49","v":"2010-05-01"},{"$f":"+[1]a2_1ind!AD49","v":7328.2749739800056},{"$f":"+[1]a2_1ind!AE49","v":8086.2245900890048},{"$f":"+[1]a2_1ind!AF49","v":7934.0841657500923},{"$f":"+[1]a2_1ind!AG49","v":8554.5731883627705},{"$f":"+[1]a2_1ind!AH49","v":6218.1815048540648},{"$f":"+[1]a2_1ind!AI49","v":7503.2169572433913}]
[{"$f":"+[1]a2_1ind!AC50","v":"2010-06-01"},{"$f":"+[1]a2_1ind!AD50","v":7955.7774573941933},{"$f":"+[1]a2_1ind!AE50","v":8466.6714463105545},{"$f":"+[1]a2_1ind!AF50","v":8139.809264685272},{"$f":"+[1]a2_1ind!AG50","v":8703.1256293496335},{"$f":"+[1]a2_1ind!AH50","v":6381.8896069067641},{"$f":"+[1]a2_1ind!AI50","v":7798.4614092859856}]
[{"$f":"+[1]a2_1ind!AC51","v":"2010-07-01"},{"$f":"+[1]a2_1ind!AD51","v":7972.3172227122523},{"$f":"+[1]a2_1ind!AE51","v":8783.9962611961091},{"$f":"+[1]a2_1ind!AF51","v":8099.4093994185159},{"$f":"+[1]a2_1ind!AG51","v":9126.4265816762672},{"$f":"+[1]a2_1ind!AH51","v":6898.107663280337},{"$f":"+[1]a2_1ind!AI51","v":8114.4916404442429}]
[{"$f":"+[1]a2_1ind!AC52","v":"2010-08-01"},{"$f":"+[1]a2_1ind!AD52","v":7936.9069180652723},{"$f":"+[1]a2_1ind!AE52","v":8619.5375383446481},{"$f":"+[1]a2_1ind!AF52","v":7895.4725079300515},{"$f":"+[1]a2_1ind!AG52","v":8850.4290672188072},{"$f":"+[1]a2_1ind!AH52","v":6850.8656776301423},{"$f":"+[1]a2_1ind!AI52","v":7970.8080453458906}]
[{"$f":"+[1]a2_1ind!AC53","v":"2010-09-01"},{"$f":"+[1]a2_1ind!AD53","v":8139.9140246004181},{"$f":"+[1]a2_1ind!AE53","v":8722.1824396465126},{"$f":"+[1]a2_1ind!AF53","v":7918.905115895569},{"$f":"+[1]a2_1ind!AG53","v":9074.7118669984829},{"$f":"+[1]a2_1ind!AH53","v":6943.0650504455798},{"$f":"+[1]a2_1ind!AI53","v":8064.321105316214}]
[{"$f":"+[1]a2_1ind!AC54","v":"2010-10-01"},{"$f":"+[1]a2_1ind!AD54","v":8027.7844993051613},{"$f":"+[1]a2_1ind!AE54","v":8711.0361948505561},{"$f":"+[1]a2_1ind!AF54","v":8024.896554160222},{"$f":"+[1]a2_1ind!AG54","v":8952.6972856397861},{"$f":"+[1]a2_1ind!AH54","v":7075.1006485624812},{"$f":"+[1]a2_1ind!AI54","v":8154.767473795263}]
[{"$f":"+[1]a2_1ind!AC55","v":"2010-11-01"},{"$f":"+[1]a2_1ind!AD55","v":7867.8014943521148},{"$f":"+[1]a2_1ind!AE55","v":8447.1623252314985},{"$f":"+[1]a2_1ind!AF55","v":7906.061846016426},{"$f":"+[1]a2_1ind!AG55","v":8655.9556828431032},{"$f":"+[1]a2_1ind!AH55","v":6811.8080740880014},{"$f":"+[1]a2_1ind!AI55","v":7877.6466802682926}]
[{"$f":"+[1]a2_1ind!AC56","v":"2010-12-01"},{"$f":"+[1]a2_1ind!AD56","v":8234.1385857249497},{"$f":"+[1]a2_1ind!AE56","v":8532.3541148350869},{"$f":"+[1]a2_1ind!AF56","v":8087.5136101662501},{"$f":"+[1]a2_1ind!AG56","v":8824.5827466953742},{"$f":"+[1]a2_1ind!AH56","v":7168.5021081663017},{"$f":"+[1]a2_1ind!AI56","v":8043.0459783457854}]
[{"$f":"+[1]a2_1ind!AC57","v":"2011-01-01"},{"$f":"+[1]a2_1ind!AD57","v":8148.0204001360053},{"$f":"+[1]a2_1ind!AE57","v":8302.2189565149129},{"$f":"+[1]a2_1ind!AF57","v":8045.3882172719168},{"$f":"+[1]a2_1ind!AG57","v":8544.2226157599143},{"$f":"+[1]a2_1ind!AH57","v":7497.3335669812959},{"$f":"+[1]a2_1ind!AI57","v":8024.0751455908994}]
[{"$f":"+[1]a2_1ind!AC58","v":"2011-02-01"},{"$f":"+[1]a2_1ind!AD58","v":7933.5059538323894},{"$f":"+[1]a2_1ind!AE58","v":8317.6170964969588},{"$f":"+[1]a2_1ind!AF58","v":7931.2197113447555},{"$f":"+[1]a2_1ind!AG58","v":8540.614377933176},{"$f":"+[1]a2_1ind!AH58","v":7345.2273323756372},{"$f":"+[1]a2_1ind!AI58","v":7988.2582243611196}]
[{"$f":"+[1]a2_1ind!AC59","v":"2011-03-01"},{"$f":"+[1]a2_1ind!AD59","v":7630.4627990267563},{"$f":"+[1]a2_1ind!AE59","v":7795.98513774201},{"$f":"+[1]a2_1ind!AF59","v":7360.7691238690895},{"$f":"+[1]a2_1ind!AG59","v":7932.4505690600081},{"$f":"+[1]a2_1ind!AH59","v":6753.3102964863692},{"$f":"+[1]a2_1ind!AI59","v":7437.7180071988723}]
[{"$f":"+[1]a2_1ind!AC60","v":"2011-04-01"},{"$f":"+[1]a2_1ind!AD60","v":7951.6526701734811},{"$f":"+[1]a2_1ind!AE60","v":8090.0264006836378},{"$f":"+[1]a2_1ind!AF60","v":7938.6867003767748},{"$f":"+[1]a2_1ind!AG60","v":8633.3089874394973},{"$f":"+[1]a2_1ind!AH60","v":7396.584550976535},{"$f":"+[1]a2_1ind!AI60","v":7900.7915835802978}]
[{"$f":"+[1]a2_1ind!AC61","v":"2011-05-01"},{"$f":"+[1]a2_1ind!AD61","v":7863.217256955827},{"$f":"+[1]a2_1ind!AE61","v":8327.3867775513372},{"$f":"+[1]a2_1ind!AF61","v":7893.6718799038226},{"$f":"+[1]a2_1ind!AG61","v":8675.0191885690747},{"$f":"+[1]a2_1ind!AH61","v":7268.4545225912516},{"$f":"+[1]a2_1ind!AI61","v":7948.0350822925393}]
[{"$f":"+[1]a2_1ind!AC62","v":"2011-06-01"},{"$f":"+[1]a2_1ind!AD62","v":7888.7438899832205},{"$f":"+[1]a2_1ind!AE62","v":8071.2972005455304},{"$f":"+[1]a2_1ind!AF62","v":7599.6281794096485},{"$f":"+[1]a2_1ind!AG62","v":8593.7780370487399},{"$f":"+[1]a2_1ind!AH62","v":7218.2596156630179},{"$f":"+[1]a2_1ind!AI62","v":7801.0388166027324}]
[{"$f":"+[1]a2_1ind!AC63","v":"2011-07-01"},{"$f":"+[1]a2_1ind!AD63","v":0},{"$f":"+[1]a2_1ind!AE63","v":0},{"$f":"+[1]a2_1ind!AF63","v":0},{"$f":"+[1]a2_1ind!AG63","v":0},{"$f":"+[1]a2_1ind!AH63","v":0},{"$f":"+[1]a2_1ind!AI63","v":0}]
[{"$f":"+[1]a2_1ind!AC64","v":"2011-08-01"},{"$f":"+[1]a2_1ind!AD64","v":0},{"$f":"+[1]a2_1ind!AE64","v":0},{"$f":"+[1]a2_1ind!AF64","v":0},{"$f":"+[1]a2_1ind!AG64","v":0},{"$f":"+[1]a2_1ind!AH64","v":0},{"$f":"+[1]a2_1ind!AI64","v":0}]
[{"$f":"+[1]a2_1ind!AC65","v":"2011-09-01"},{"$f":"+[1]a2_1ind!AD65","v":0},{"$f":"+[1]a2_1ind!AE65","v":0},{"$f":"+[1]a2_1ind!AF65","v":0},{"$f":"+[1]a2_1ind!AG65","v":0},{"$f":"+[1]a2_1ind!AH65","v":0},{"$f":"+[1]a2_1ind!AI65","v":0}]
[{"$f":"+[1]a2_1ind!AC66","v":"2011-10-01"},{"$f":"+[1]a2_1ind!AD66","v":0},{"$f":"+[1]a2_1ind!AE66","v":0},{"$f":"+[1]a2_1ind!AF66","v":0},{"$f":"+[1]a2_1ind!AG66","v":0},{"$f":"+[1]a2_1ind!AH66","v":0},{"$f":"+[1]a2_1ind!AI66","v":0}]
[{"$f":"+[1]a2_1ind!AC67","v":"2011-11-01"},{"$f":"+[1]a2_1ind!AD67","v":0},{"$f":"+[1]a2_1ind!AE67","v":0},{"$f":"+[1]a2_1ind!AF67","v":0},{"$f":"+[1]a2_1ind!AG67","v":0},{"$f":"+[1]a2_1ind!AH67","v":0},{"$f":"+[1]a2_1ind!AI67","v":0}]
[{"$f":"+[1]a2_1ind!AC68","v":"2011-12-01"},{"$f":"+[1]a2_1ind!AD68","v":0},{"$f":"+[1]a2_1ind!AE68","v":0},{"$f":"+[1]a2_1ind!AF68","v":0},{"$f":"+[1]a2_1ind!AG68","v":0},{"$f":"+[1]a2_1ind!AH68","v":0},{"$f":"+[1]a2_1ind!AI68","v":0}]
[{"$f":"+[1]a2_1ind!AC69","v":"00:00:00"},{"$f":"+[1]a2_1ind!AD69","v":0},{"$f":"+[1]a2_1ind!AE69","v":0},{"$f":"+[1]a2_1ind!AF69","v":0},{"$f":"+[1]a2_1ind!AG69","v":0},{"$f":"+[1]a2_1ind!AH69","v":0},{"$f":"+[1]a2_1ind!AI69","v":0}]
[{"$f":"+[1]a2_1ind!AC70","v":"00:00:00"},{"$f":"+[1]a2_1ind!AD70","v":0},{"$f":"+[1]a2_1ind!AE70","v":0},{"$f":"+[1]a2_1ind!AF70","v":0},{"$f":"+[1]a2_1ind!AG70","v":0},{"$f":"+[1]a2_1ind!AH70","v":0},{"$f":"+[1]a2_1ind!AI70","v":0}]
[{"$f":"+[1]a2_1ind!AC71","v":"00:00:00"},{"$f":"+[1]a2_1ind!AD71","v":0},{"$f":"+[1]a2_1ind!AE71","v":0},{"$f":"+[1]a2_1ind!AF71","v":0},{"$f":"+[1]a2_1ind!AG71","v":0},{"$f":"+[1]a2_1ind!AH71","v":0},{"$f":"+[1]a2_1ind!AI71","v":0}]
[{"$f":"+[1]a2_1ind!AC72","v":"00:00:00"},{"$f":"+[1]a2_1ind!AD72","v":0},{"$f":"+[1]a2_1ind!AE72","v":0},{"$f":"+[1]a2_1ind!AF72","v":0},{"$f":"+[1]a2_1ind!AG72","v":0},{"$f":"+[1]a2_1ind!AH72","v":0},{"$f":"+[1]a2_1ind!AI72","v":0}]
[{"$f":"+[1]a2_1ind!AC73","v":"00:00:00"},{"$f":"+[1]a2_1ind!AD73","v":0},{"$f":"+[1]a2_1ind!AE73","v":0},{"$f":"+[1]a2_1ind!AF73","v":0},{"$f":"+[1]a2_1ind!AG73","v":0},{"$f":"+[1]a2_1ind!AH73","v":0},{"$f":"+[1]a2_1ind!AI73","v":0}]
[{"$f":"+[1]a2_1ind!AC74","v":"00:00:00"},{"$f":"+[1]a2_1ind!AD74","v":0},{"$f":"+[1]a2_1ind!AE74","v":0},{"$f":"+[1]a2_1ind!AF74","v":0},{"$f":"+[1]a2_1ind!AG74","v":0},{"$f":"+[1]a2_1ind!AH74","v":0},{"$f":"+[1]a2_1ind!AI74","v":0}]
[{"$f":"+[1]a2_1ind!AC75","v":"00:00:00"},{"$f":"+[1]a2_1ind!AD75","v":0},{"$f":"+[1]a2_1ind!AE75","v":0},{"$f":"+[1]a2_1ind!AF75","v":0},{"$f":"+[1]a2_1ind!AG75","v":0},{"$f":"+[1]a2_1ind!AH75","v":0},{"$f":"+[1]a2_1ind!AI75","v":0}]
[{"$f":"+[1]a2_1ind!AC76","v":"00:00:00"},{"$f":"+[1]a2_1ind!AD76","v":0},{"$f":"+[1]a2_1ind!AE76","v":0},{"$f":"+[1]a2_1ind!AF76","v":0},{"$f":"+[1]a2_1ind!AG76","v":0},{"$f":"+[1]a2_1ind!AH76","v":0},{"$f":"+[1]a2_1ind!AI76","v":0}]
[{"$f":"+[1]a2_1ind!AC77","v":"00:00:00"},{"$f":"+[1]a2_1ind!AD77","v":0},{"$f":"+[1]a2_1ind!AE77","v":0},{"$f":"+[1]a2_1ind!AF77","v":0},{"$f":"+[1]a2_1ind!AG77","v":0},{"$f":"+[1]a2_1ind!AH77","v":0},{"$f":"+[1]a2_1ind!AI77","v":0}]
[{"$f":"+[1]a2_1ind!AC78","v":"00:00:00"},{"$f":"+[1]a2_1ind!AD78","v":0},{"$f":"+[1]a2_1ind!AE78","v":0},{"$f":"+[1]a2_1ind!AF78","v":0},{"$f":"+[1]a2_1ind!AG78","v":0},{"$f":"+[1]a2_1ind!AH78","v":0},{"$f":"+[1]a2_1ind!AI78","v":0}]
[{"$f":"+[1]a2_1ind!AC79","v":"00:00:00"},{"$f":"+[1]a2_1ind!AD79","v":0},{"$f":"+[1]a2_1ind!AE79","v":0},{"$f":"+[1]a2_1ind!AF79","v":0},{"$f":"+[1]a2_1ind!AG79","v":0},{"$f":"+[1]a2_1ind!AH79","v":0},{"$f":"+[1]a2_1ind!AI79","v":0}]
[{"$f":"+[1]a2_1ind!AC80","v":"00:00:00"},{"$f":"+[1]a2_1ind!AD80","v":0},{"$f":"+[1]a2_1ind!AE80","v":0},{"$f":"+[1]a2_1ind!AF80","v":0},{"$f":"+[1]a2_1ind!AG80","v":0},{"$f":"+[1]a2_1ind!AH80","v":0},{"$f":"+[1]a2_1ind!AI80","v":0}]

{"sheet":"Evo. prom boleta por Exhibidor","index":19,"n_rows":80,"n_cols":11,"rows_kept":80,"cut":false,"hidden":false,"merged":[]}
[{"$f":"+[1]a2_2ind!AC5","v":"PRECIO PESOS TERMINOS REALES"}]
[{"$f":"+[1]a2_2ind!AC6","v":"Fecha"},{"$f":"+[1]a2_2ind!AD6","v":"CINE COLOMBIA"},{"$f":"+[1]a2_2ind!AE6","v":"CINEMARK"},{"$f":"+[1]a2_2ind!AF6","v":"PROCINAL"},{"$f":"+[1]a2_2ind!AG6","v":"ROYAL FILMS"},{"$f":"+[1]a2_2ind!AH6","v":"RESTO"},{"$f":"+[1]a2_2ind!AI6","v":"NACIONAL"}]
[null,{"$f":"+PROPER(B2)","v":"Cine Colombia"},{"$f":"+PROPER(C2)","v":"Cinemark"},"Procinal","Royal Films","Resto","Nacional"]
[{"$f":"+[1]a2_2ind!AC7","v":"2006-09-01"},{"$f":"+[1]a2_2ind!AD7","v":8810.2687273501051},{"$f":"+[1]a2_2ind!AE7","v":8291.5160015565361},{"$f":"+[1]a2_2ind!AF7","v":8117.6911118513599},{"$f":"+[1]a2_2ind!AG7","v":6963.9903836088788},{"$f":"+[1]a2_2ind!AH7","v":6633.7591610033187},{"$f":"+[1]a2_2ind!AI7","v":8407.6107853158355}]
[{"$f":"+[1]a2_2ind!AC8","v":"2006-10-01"},{"$f":"+[1]a2_2ind!AD8","v":6474.5155311639828},{"$f":"+[1]a2_2ind!AE8","v":7264.8335837354753},{"$f":"+[1]a2_2ind!AF8","v":6271.5037130520741},{"$f":"+[1]a2_2ind!AG8","v":5375.0313191135965},{"$f":"+[1]a2_2ind!AH8","v":6445.3457413473407},{"$f":"+[1]a2_2ind!AI8","v":6506.4888378834348}]
[{"$f":"+[1]a2_2ind!AC9","v":"2006-11-01"},{"$f":"+[1]a2_2ind!AD9","v":8938.3880519386566},{"$f":"+[1]a2_2ind!AE9","v":8678.215167486047},{"$f":"+[1]a2_2ind!AF9","v":8158.0600710309973},{"$f":"+[1]a2_2ind!AG9","v":7115.3033879327286},{"$f":"+[1]a2_2ind!AH9","v":7244.0964602606127},{"$f":"+[1]a2_2ind!AI9","v":8605.7991899006411}]
[{"$f":"+[1]a2_2ind!AC10","v":"2006-12-01"},{"$f":"+[1]a2_2ind!AD10","v":8907.1954627106388},{"$f":"+[1]a2_2ind!AE10","v":8453.8189359021508},{"$f":"+[1]a2_2ind!AF10","v":7487.4937421237082},{"$f":"+[1]a2_2ind!AG10","v":6881.028715497182},{"$f":"+[1]a2_2ind!AH10","v":6736.4723938508641},{"$f":"+[1]a2_2ind!AI10","v":8418.4720500787407}]
[{"$f":"+[1]a2_2ind!AC11","v":"2007-01-01"},{"$f":"+[1]a2_2ind!AD11","v":9313.8777948981715},{"$f":"+[1]a2_2ind!AE11","v":8852.9611674883672},{"$f":"+[1]a2_2ind!AF11","v":7971.7383037681057},{"$f":"+[1]a2_2ind!AG11","v":7547.6608193048487},{"$f":"+[1]a2_2ind!AH11","v":6773.2325987710446},{"$f":"+[1]a2_2ind!AI11","v":8834.7221764828155}]
[{"$f":"+[1]a2_2ind!AC12","v":"2007-02-01"},{"$f":"+[1]a2_2ind!AD12","v":9556.0796769764765},{"$f":"+[1]a2_2ind!AE12","v":8960.2695101095342},{"$f":"+[1]a2_2ind!AF12","v":8415.0351537052156},{"$f":"+[1]a2_2ind!AG12","v":7654.3401151408634},{"$f":"+[1]a2_2ind!AH12","v":7158.579694281997},{"$f":"+[1]a2_2ind!AI12","v":9070.5902816323887}]
[{"$f":"+[1]a2_2ind!AC13","v":"2007-03-01"},{"$f":"+[1]a2_2ind!AD13","v":9389.3799283242915},{"$f":"+[1]a2_2ind!AE13","v":9005.8119029021836},{"$f":"+[1]a2_2ind!AF13","v":8385.1527108420869},{"$f":"+[1]a2_2ind!AG13","v":7676.1495110759188},{"$f":"+[1]a2_2ind!AH13","v":6943.4743712772743},{"$f":"+[1]a2_2ind!AI13","v":8979.1286862777615}]
[{"$f":"+[1]a2_2ind!AC14","v":"2007-04-01"},{"$f":"+[1]a2_2ind!AD14","v":8837.056388891353},{"$f":"+[1]a2_2ind!AE14","v":8620.5946942483679},{"$f":"+[1]a2_2ind!AF14","v":7618.6773377784984},{"$f":"+[1]a2_2ind!AG14","v":7286.2989714546093},{"$f":"+[1]a2_2ind!AH14","v":6593.1404746418311},{"$f":"+[1]a2_2ind!AI14","v":8446.2580195370465}]
[{"$f":"+[1]a2_2ind!AC15","v":"2007-05-01"},{"$f":"+[1]a2_2ind!AD15","v":9007.381255096825},{"$f":"+[1]a2_2ind!AE15","v":8625.4385809631003},{"$f":"+[1]a2_2ind!AF15","v":8024.7969142606562},{"$f":"+[1]a2_2ind!AG15","v":7443.2042127490304},{"$f":"+[1]a2_2ind!AH15","v":5988.8839239795134},{"$f":"+[1]a2_2ind!AI15","v":8489.5869988348404}]
[{"$f":"+[1]a2_2ind!AC16","v":"2007-06-01"},{"$f":"+[1]a2_2ind!AD16","v":8819.2138095992996},{"$f":"+[1]a2_2ind!AE16","v":8583.2008762088026},{"$f":"+[1]a2_2ind!AF16","v":8119.1701797705755},{"$f":"+[1]a2_2ind!AG16","v":7418.4528905273046},{"$f":"+[1]a2_2ind!AH16","v":5918.629304916265},{"$f":"+[1]a2_2ind!AI16","v":8453.0931777032929}]
[{"$f":"+[1]a2_2ind!AC17","v":"2007-07-01"},{"$f":"+[1]a2_2ind!AD17","v":8770.5881234624994},{"$f":"+[1]a2_2ind!AE17","v":8326.2977656657531},{"$f":"+[1]a2_2ind!AF17","v":8188.1077930915353},{"$f":"+[1]a2_2ind!AG17","v":7230.5974647369449},{"$f":"+[1]a2_2ind!AH17","v":5845.2933898122174},{"$f":"+[1]a2_2ind!AI17","v":8362.958598997815}]
[{"$f":"+[1]a2_2ind!AC18","v":"2007-08-01"},{"$f":"+[1]a2_2ind!AD18","v":8892.9390972877427},{"$f":"+[1]a2_2ind!AE18","v":8537.0427336743251},{"$f":"+[1]a2_2ind!AF18","v":8413.8191369201868},{"$f":"+[1]a2_2ind!AG18","v":7391.762570952541},{"$f":"+[1]a2_2ind!AH18","v":5871.4149336057853},{"$f":"+[1]a2_2ind!AI18","v":8533.9849889469624}]
[{"$f":"+[1]a2_2ind!AC19","v":"2007-09-01"},{"$f":"+[1]a2_2ind!AD19","v":8803.8730306056477},{"$f":"+[1]a2_2ind!AE19","v":8590.7600977261445},{"$f":"+[1]a2_2ind!AF19","v":8017.9373729121116},{"$f":"+[1]a2_2ind!AG19","v":7265.9734954651703},{"$f":"+[1]a2_2ind!AH19","v":5739.7847755361408},{"$f":"+[1]a2_2ind!AI19","v":8457.8490275385175}]
[{"$f":"+[1]a2_2ind!AC20","v":"2007-10-01"},{"$f":"+[1]a2_2ind!AD20","v":7159.436677296193},{"$f":"+[1]a2_2ind!AE20","v":7343.5636180245911},{"$f":"+[1]a2_2ind!AF20","v":5984.2676206612359},{"$f":"+[1]a2_2ind!AG20","v":6158.765170298173},{"$f":"+[1]a2_2ind!AH20","v":5582.723386534899},{"$f":"+[1]a2_2ind!AI20","v":6946.8190304591399}]
[{"$f":"+[1]a2_2ind!AC21","v":"2007-11-01"},{"$f":"+[1]a2_2ind!AD21","v":8814.9701553133873},{"$f":"+[1]a2_2ind!AE21","v":9396.2242009372167},{"$f":"+[1]a2_2ind!AF21","v":8128.4147951237237},{"$f":"+[1]a2_2ind!AG21","v":7491.0779311536435},{"$f":"+[1]a2_2ind!AH21","v":6296.0381645067218},{"$f":"+[1]a2_2ind!AI21","v":8668.5213124131478}]
[{"$f":"+[1]a2_2ind!AC22","v":"2007-12-01"},{"$f":"+[1]a2_2ind!AD22","v":8797.8945711667529},{"$f":"+[1]a2_2ind!AE22","v":9113.633967091193},{"$f":"+[1]a2_2ind!AF22","v":8007.7780402087819},{"$f":"+[1]a2_2ind!AG22","v":7103.1124731645614},{"$f":"+[1]a2_2ind!AH22","v":6243.6067891138373},{"$f":"+[1]a2_2ind!AI22","v":8524.1508882297603}]
[{"$f":"+[1]a2_2ind!AC23","v":"2008-01-01"},{"$f":"+[1]a2_2ind!AD23","v":8942.8404734714641},{"$f":"+[1]a2_2ind!AE23","v":9165.6018853526766},{"$f":"+[1]a2_2ind!AF23","v":8046.949711542753},{"$f":"+[1]a2_2ind!AG23","v":6812.2862817138239},{"$f":"+[1]a2_2ind!AH23","v":6601.0208715579965},{"$f":"+[1]a2_2ind!AI23","v":8629.446978538801}]
[{"$f":"+[1]a2_2ind!AC24","v":"2008-02-01"},{"$f":"+[1]a2_2ind!AD24","v":8961.670219341484},{"$f":"+[1]a2_2ind!AE24","v":8974.0826710788697},{"$f":"+[1]a2_2ind!AF24","v":8179.1930985284453},{"$f":"+[1]a2_2ind!AG24","v":6613.511457031861},{"$f":"+[1]a2_2ind!AH24","v":7440.9387850185249},{"$f":"+[1]a2_2ind!AI24","v":8574.6292867029824}]
[{"$f":"+[1]a2_2ind!AC25","v":"2008-03-01"},{"$f":"+[1]a2_2ind!AD25","v":8775.5060944630604},{"$f":"+[1]a2_2ind!AE25","v":9265.7428906533078},{"$f":"+[1]a2_2ind!AF25","v":7789.9521039077681},{"$f":"+[1]a2_2ind!AG25","v":7113.6662092385377},{"$f":"+[1]a2_2ind!AH25","v":7157.6982696714067},{"$f":"+[1]a2_2ind!AI25","v":8515.6311935761096}]
[{"$f":"+[1]a2_2ind!AC26","v":"2008-04-01"},{"$f":"+[1]a2_2ind!AD26","v":8352.0377946114913},{"$f":"+[1]a2_2ind!AE26","v":9096.3812576638666},{"$f":"+[1]a2_2ind!AF26","v":7358.15053646663},{"$f":"+[1]a2_2ind!AG26","v":7023.6090497306286},{"$f":"+[1]a2_2ind!AH26","v":7240.2323504972646},{"$f":"+[1]a2_2ind!AI26","v":8179.435336239776}]
[{"$f":"+[1]a2_2ind!AC27","v":"2008-05-01"},{"$f":"+[1]a2_2ind!AD27","v":8742.9269267210675},{"$f":"+[1]a2_2ind!AE27","v":9286.355056186505},{"$f":"+[1]a2_2ind!AF27","v":7626.8684858754486},{"$f":"+[1]a2_2ind!AG27","v":7227.4765425429832},{"$f":"+[1]a2_2ind!AH27","v":8001.9317036470929},{"$f":"+[1]a2_2ind!AI27","v":8496.9016774804168}]
[{"$f":"+[1]a2_2ind!AC28","v":"2008-06-01"},{"$f":"+[1]a2_2ind!AD28","v":8384.9477483449409},{"$f":"+[1]a2_2ind!AE28","v":8825.9978589288185},{"$f":"+[1]a2_2ind!AF28","v":7190.569825771664},{"$f":"+[1]a2_2ind!AG28","v":7094.1933285374043},{"$f":"+[1]a2_2ind!AH28","v":7824.419770036965},{"$f":"+[1]a2_2ind!AI28","v":8122.5752057945056}]
[{"$f":"+[1]a2_2ind!AC29","v":"2008-07-01"},{"$f":"+[1]a2_2ind!AD29","v":8151.082252296238},{"$f":"+[1]a2_2ind!AE29","v":8392.5798996644371},{"$f":"+[1]a2_2ind!AF29","v":6970.6024476906441},{"$f":"+[1]a2_2ind!AG29","v":7039.8081531594489},{"$f":"+[1]a2_2ind!AH29","v":7503.3450079529621},{"$f":"+[1]a2_2ind!AI29","v":7881.5532938658871}]
[{"$f":"+[1]a2_2ind!AC30","v":"2008-08-01"},{"$f":"+[1]a2_2ind!AD30","v":8517.6501516268399},{"$f":"+[1]a2_2ind!AE30","v":8324.4849733546471},{"$f":"+[1]a2_2ind!AF30","v":6612.3945841463665},{"$f":"+[1]a2_2ind!AG30","v":7209.5341877823894},{"$f":"+[1]a2_2ind!AH30","v":7869.0803860104088},{"$f":"+[1]a2_2ind!AI30","v":8052.9203986227567}]
[{"$f":"+[1]a2_2ind!AC31","v":"2008-09-01"},{"$f":"+[1]a2_2ind!AD31","v":8494.5988151596248},{"$f":"+[1]a2_2ind!AE31","v":8151.660563611882},{"$f":"+[1]a2_2ind!AF31","v":6737.0279530507878},{"$f":"+[1]a2_2ind!AG31","v":7245.3221333019901},{"$f":"+[1]a2_2ind!AH31","v":7640.5513434301283},{"$f":"+[1]a2_2ind!AI31","v":8029.1105784736283}]
[{"$f":"+[1]a2_2ind!AC32","v":"2008-10-01"},{"$f":"+[1]a2_2ind!AD32","v":8405.965453732857},{"$f":"+[1]a2_2ind!AE32","v":6739.8887608733849},{"$f":"+[1]a2_2ind!AF32","v":7289.273032557955},{"$f":"+[1]a2_2ind!AG32","v":6981.9364320156565},{"$f":"+[1]a2_2ind!AH32","v":7495.8196603806136},{"$f":"+[1]a2_2ind!AI32","v":7729.9481277221821},null,null,null,"Evolución real del precio promedio de la boleta por exhibidor"]
[{"$f":"+[1]a2_2ind!AC33","v":"2008-11-01"},{"$f":"+[1]a2_2ind!AD33","v":8538.9318053647621},{"$f":"+[1]a2_2ind!AE33","v":7606.491636801803},{"$f":"+[1]a2_2ind!AF33","v":6497.6847407109817},{"$f":"+[1]a2_2ind!AG33","v":7318.5394936559378},{"$f":"+[1]a2_2ind!AH33","v":7948.2436951231557},{"$f":"+[1]a2_2ind!AI33","v":7935.5827302075922}]
[{"$f":"+[1]a2_2ind!AC34","v":"2008-12-01"},{"$f":"+[1]a2_2ind!AD34","v":8767.3337112045592},{"$f":"+[1]a2_2ind!AE34","v":8301.7663939179711},{"$f":"+[1]a2_2ind!AF34","v":6316.6087718031331},{"$f":"+[1]a2_2ind!AG34","v":7323.1128970459677},{"$f":"+[1]a2_2ind!AH34","v":7617.131105508829},{"$f":"+[1]a2_2ind!AI34","v":8125.2661546865702}]
[{"$f":"+[1]a2_2ind!AC35","v":"2009-01-01"},{"$f":"+[1]a2_2ind!AD35","v":9510.5803812107697},{"$f":"+[1]a2_2ind!AE35","v":8493.8575647269463},{"$f":"+[1]a2_2ind!AF35","v":6319.7683176815208},{"$f":"+[1]a2_2ind!AG35","v":7538.7084366972294},{"$f":"+[1]a2_2ind!AH35","v":7525.9178836911306},{"$f":"+[1]a2_2ind!AI35","v":8560.2059693393221}]
[{"$f":"+[1]a2_2ind!AC36","v":"2009-02-01"},{"$f":"+[1]a2_2ind!AD36","v":9471.9448491926414},{"$f":"+[1]a2_2ind!AE36","v":8095.8301702827148},{"$f":"+[1]a2_2ind!AF36","v":5955.6535750675421},{"$f":"+[1]a2_2ind!AG36","v":7435.2495653641026},{"$f":"+[1]a2_2ind!AH36","v":7420.8336772047087},{"$f":"+[1]a2_2ind!AI36","v":8406.0841776950547}]
[{"$f":"+[1]a2_2ind!AC37","v":"2009-03-01"},{"$f":"+[1]a2_2ind!AD37","v":9434.1931192317788},{"$f":"+[1]a2_2ind!AE37","v":7982.168029844277},{"$f":"+[1]a2_2ind!AF37","v":5291.2211535385322},{"$f":"+[1]a2_2ind!AG37","v":7287.928598307989},{"$f":"+[1]a2_2ind!AH37","v":7550.4843422250515},{"$f":"+[1]a2_2ind!AI37","v":8137.2714716484943}]
[{"$f":"+[1]a2_2ind!AC38","v":"2009-04-01"},{"$f":"+[1]a2_2ind!AD38","v":9195.8900357458042},{"$f":"+[1]a2_2ind!AE38","v":8240.9680054370492},{"$f":"+[1]a2_2ind!AF38","v":5022.693251446487},{"$f":"+[1]a2_2ind!AG38","v":5969.6977800279683},{"$f":"+[1]a2_2ind!AH38","v":8854.3926880280706},{"$f":"+[1]a2_2ind!AI38","v":7861.8276328965549}]
[{"$f":"+[1]a2_2ind!AC39","v":"2009-05-01"},{"$f":"+[1]a2_2ind!AD39","v":9210.7426290689527},{"$f":"+[1]a2_2ind!AE39","v":7580.1846359389328},{"$f":"+[1]a2_2ind!AF39","v":5125.6485643153492},{"$f":"+[1]a2_2ind!AG39","v":6589.5952997186459},{"$f":"+[1]a2_2ind!AH39","v":7964.8790691999784},{"$f":"+[1]a2_2ind!AI39","v":7760.487224210091}]
[{"$f":"+[1]a2_2ind!AC40","v":"2009-06-01"},{"$f":"+[1]a2_2ind!AD40","v":9551.6315644925471},{"$f":"+[1]a2_2ind!AE40","v":8091.4717601200728},{"$f":"+[1]a2_2ind!AF40","v":5117.5420496162933},{"$f":"+[1]a2_2ind!AG40","v":6958.4153724651214},{"$f":"+[1]a2_2ind!AH40","v":7959.8783403932148},{"$f":"+[1]a2_2ind!AI40","v":8005.7318201907556}]
[{"$f":"+[1]a2_2ind!AC41","v":"2009-07-01"},{"$f":"+[1]a2_2ind!AD41","v":9418.4170412332023},{"$f":"+[1]a2_2ind!AE41","v":7929.1767663365608},{"$f":"+[1]a2_2ind!AF41","v":5070.3395288412512},{"$f":"+[1]a2_2ind!AG41","v":6897.2076395354989},{"$f":"+[1]a2_2ind!AH41","v":8241.0442269005925},{"$f":"+[1]a2_2ind!AI41","v":7910.0135049416685}]
[{"$f":"+[1]a2_2ind!AC42","v":"2009-08-01"},{"$f":"+[1]a2_2ind!AD42","v":9630.800452527159},{"$f":"+[1]a2_2ind!AE42","v":7907.5077773154489},{"$f":"+[1]a2_2ind!AF42","v":5084.0105913849147},{"$f":"+[1]a2_2ind!AG42","v":7012.5886186460075},{"$f":"+[1]a2_2ind!AH42","v":7584.3334175940163},{"$f":"+[1]a2_2ind!AI42","v":7968.5901802758663}]
[{"$f":"+[1]a2_2ind!AC43","v":"2009-09-01"},{"$f":"+[1]a2_2ind!AD43","v":9342.8606152343018},{"$f":"+[1]a2_2ind!AE43","v":7783.1676024947974},{"$f":"+[1]a2_2ind!AF43","v":4590.8090528293833},{"$f":"+[1]a2_2ind!AG43","v":6400.6733758787004},{"$f":"+[1]a2_2ind!AH43","v":7357.7472435390082},{"$f":"+[1]a2_2ind!AI43","v":7517.7721395237058}]
[{"$f":"+[1]a2_2ind!AC44","v":"2009-10-01"},{"$f":"+[1]a2_2ind!AD44","v":9116.3986872510141},{"$f":"+[1]a2_2ind!AE44","v":7860.494301175122},{"$f":"+[1]a2_2ind!AF44","v":4436.6092936545347},{"$f":"+[1]a2_2ind!AG44","v":6054.1801467728237},{"$f":"+[1]a2_2ind!AH44","v":6840.2833336332251},{"$f":"+[1]a2_2ind!AI44","v":7237.6330315040505}]
[{"$f":"+[1]a2_2ind!AC45","v":"2009-11-01"},{"$f":"+[1]a2_2ind!AD45","v":8037.2434425233632},{"$f":"+[1]a2_2ind!AE45","v":6897.3378077418502},{"$f":"+[1]a2_2ind!AF45","v":4649.0730713081848},{"$f":"+[1]a2_2ind!AG45","v":5687.3602044251211},{"$f":"+[1]a2_2ind!AH45","v":6437.9804360000562},{"$f":"+[1]a2_2ind!AI45","v":6739.3957291932902}]
[{"$f":"+[1]a2_2ind!AC46","v":"2009-12-01"},{"$f":"+[1]a2_2ind!AD46","v":8446.1587271022727},{"$f":"+[1]a2_2ind!AE46","v":7362.605084376135},{"$f":"+[1]a2_2ind!AF46","v":4968.2769542465012},{"$f":"+[1]a2_2ind!AG46","v":5898.0789550248937},{"$f":"+[1]a2_2ind!AH46","v":7403.7124654259069},{"$f":"+[1]a2_2ind!AI46","v":7223.8326151554211}]
[{"$f":"+[1]a2_2ind!AC47","v":"2010-01-01"},{"$f":"+[1]a2_2ind!AD47","v":8928.2617339603275},{"$f":"+[1]a2_2ind!AE47","v":7770.5560926991302},{"$f":"+[1]a2_2ind!AF47","v":5549.2382780007229},{"$f":"+[1]a2_2ind!AG47","v":6307.9912527405841},{"$f":"+[1]a2_2ind!AH47","v":7868.0578299525887},{"$f":"+[1]a2_2ind!AI47","v":7791.6178277441177}]
[{"$f":"+[1]a2_2ind!AC48","v":"2010-02-01"},{"$f":"+[1]a2_2ind!AD48","v":8952.0353785750267},{"$f":"+[1]a2_2ind!AE48","v":7879.1448481244997},{"$f":"+[1]a2_2ind!AF48","v":5576.4966973509163},{"$f":"+[1]a2_2ind!AG48","v":6324.6504536940956},{"$f":"+[1]a2_2ind!AH48","v":7680.8177141060687},{"$f":"+[1]a2_2ind!AI48","v":7835.50607113346}]
[{"$f":"+[1]a2_2ind!AC49","v":"2010-03-01"},{"$f":"+[1]a2_2ind!AD49","v":9528.055368492991},{"$f":"+[1]a2_2ind!AE49","v":8060.4398122955936},{"$f":"+[1]a2_2ind!AF49","v":5480.8250896116951},{"$f":"+[1]a2_2ind!AG49","v":6224.37746744369},{"$f":"+[1]a2_2ind!AH49","v":8141.4587772526957},{"$f":"+[1]a2_2ind!AI49","v":8099.7909567429897}]
[{"$f":"+[1]a2_2ind!AC50","v":"2010-04-01"},{"$f":"+[1]a2_2ind!AD50","v":9524.4611807225374},{"$f":"+[1]a2_2ind!AE50","v":7890.6035033912722},{"$f":"+[1]a2_2ind!AF50","v":5749.9422538234348},{"$f":"+[1]a2_2ind!AG50","v":6069.5269958680956},{"$f":"+[1]a2_2ind!AH50","v":7569.1372208797602},{"$f":"+[1]a2_2ind!AI50","v":7992.1405842759532}]
[{"$f":"+[1]a2_2ind!AC51","v":"2010-05-01"},{"$f":"+[1]a2_2ind!AD51","v":8776.4283038688372},{"$f":"+[1]a2_2ind!AE51","v":7530.1292542285919},{"$f":"+[1]a2_2ind!AF51","v":6041.8164099854848},{"$f":"+[1]a2_2ind!AG51","v":5652.2867316301945},{"$f":"+[1]a2_2ind!AH51","v":7091.0875425625154},{"$f":"+[1]a2_2ind!AI51","v":7503.2169572433913}]
[{"$f":"+[1]a2_2ind!AC52","v":"2010-06-01"},{"$f":"+[1]a2_2ind!AD52","v":8912.3591026037466},{"$f":"+[1]a2_2ind!AE52","v":7707.1983109223238},{"$f":"+[1]a2_2ind!AF52","v":6110.9557021101537},{"$f":"+[1]a2_2ind!AG52","v":5911.6675660254914},{"$f":"+[1]a2_2ind!AH52","v":8063.4179310077152},{"$f":"+[1]a2_2ind!AI52","v":7798.4614092859856}]
[{"$f":"+[1]a2_2ind!AC53","v":"2010-07-01"},{"$f":"+[1]a2_2ind!AD53","v":9189.9126349191956},{"$f":"+[1]a2_2ind!AE53","v":7885.9802406781764},{"$f":"+[1]a2_2ind!AF53","v":6327.0195679845701},{"$f":"+[1]a2_2ind!AG53","v":6612.7395751445847},{"$f":"+[1]a2_2ind!AH53","v":8469.4933305766044},{"$f":"+[1]a2_2ind!AI53","v":8114.4916404442429}]
[{"$f":"+[1]a2_2ind!AC54","v":"2010-08-01"},{"$f":"+[1]a2_2ind!AD54","v":8972.106537133217},{"$f":"+[1]a2_2ind!AE54","v":7690.6534524070039},{"$f":"+[1]a2_2ind!AF54","v":6510.3740125983222},{"$f":"+[1]a2_2ind!AG54","v":6716.9215230600184},{"$f":"+[1]a2_2ind!AH54","v":7970.0021281870986},{"$f":"+[1]a2_2ind!AI54","v":7970.8080453458906}]
[{"$f":"+[1]a2_2ind!AC55","v":"2010-09-01"},{"$f":"+[1]a2_2ind!AD55","v":9114.9224510887907},{"$f":"+[1]a2_2ind!AE55","v":7513.2662571477977},{"$f":"+[1]a2_2ind!AF55","v":6488.601923234045},{"$f":"+[1]a2_2ind!AG55","v":7174.6039083615542},{"$f":"+[1]a2_2ind!AH55","v":8018.5360590379905},{"$f":"+[1]a2_2ind!AI55","v":8064.321105316214}]
[{"$f":"+[1]a2_2ind!AC56","v":"2010-10-01"},{"$f":"+[1]a2_2ind!AD56","v":9175.4828378893253},{"$f":"+[1]a2_2ind!AE56","v":7911.5615703164158},{"$f":"+[1]a2_2ind!AF56","v":6405.059890778819},{"$f":"+[1]a2_2ind!AG56","v":6925.2882019382823},{"$f":"+[1]a2_2ind!AH56","v":8200.9787027705988},{"$f":"+[1]a2_2ind!AI56","v":8154.767473795263}]
[{"$f":"+[1]a2_2ind!AC57","v":"2010-11-01"},{"$f":"+[1]a2_2ind!AD57","v":8799.3797472299648},{"$f":"+[1]a2_2ind!AE57","v":7534.7284156581291},{"$f":"+[1]a2_2ind!AF57","v":6311.8827003615424},{"$f":"+[1]a2_2ind!AG57","v":6777.6788318891831},{"$f":"+[1]a2_2ind!AH57","v":7921.7072721048862},{"$f":"+[1]a2_2ind!AI57","v":7877.6466802682926}]
[{"$f":"+[1]a2_2ind!AC58","v":"2010-12-01"},{"$f":"+[1]a2_2ind!AD58","v":8847.2174010363815},{"$f":"+[1]a2_2ind!AE58","v":7770.9267770459601},{"$f":"+[1]a2_2ind!AF58","v":6489.0126271753934},{"$f":"+[1]a2_2ind!AG58","v":7134.5915407323419},{"$f":"+[1]a2_2ind!AH58","v":8472.0341818925008},{"$f":"+[1]a2_2ind!AI58","v":8043.0459783457854}]
[{"$f":"+[1]a2_2ind!AC59","v":"2011-01-01"},{"$f":"+[1]a2_2ind!AD59","v":8641.5956154519845},{"$f":"+[1]a2_2ind!AE59","v":8340.7789928136681},{"$f":"+[1]a2_2ind!AF59","v":6428.9929097337126},{"$f":"+[1]a2_2ind!AG59","v":7179.2726624573443},{"$f":"+[1]a2_2ind!AH59","v":8312.2610299604366},{"$f":"+[1]a2_2ind!AI59","v":8024.0751455908994}]
[{"$f":"+[1]a2_2ind!AC60","v":"2011-02-01"},{"$f":"+[1]a2_2ind!AD60","v":8630.4870573513872},{"$f":"+[1]a2_2ind!AE60","v":8543.0396818924164},{"$f":"+[1]a2_2ind!AF60","v":6267.8659061204135},{"$f":"+[1]a2_2ind!AG60","v":6895.0767701799814},{"$f":"+[1]a2_2ind!AH60","v":7892.7278723076843},{"$f":"+[1]a2_2ind!AI60","v":7988.2582243611196}]
[{"$f":"+[1]a2_2ind!AC61","v":"2011-03-01"},{"$f":"+[1]a2_2ind!AD61","v":7985.1490703320451},{"$f":"+[1]a2_2ind!AE61","v":7825.7508193138701},{"$f":"+[1]a2_2ind!AF61","v":6104.2981860670552},{"$f":"+[1]a2_2ind!AG61","v":6303.4541990859634},{"$f":"+[1]a2_2ind!AH61","v":7399.3769409690149},{"$f":"+[1]a2_2ind!AI61","v":7437.7180071988723}]
[{"$f":"+[1]a2_2ind!AC62","v":"2011-04-01"},{"$f":"+[1]a2_2ind!AD62","v":8384.9841779910403},{"$f":"+[1]a2_2ind!AE62","v":8431.9273411478498},{"$f":"+[1]a2_2ind!AF62","v":6309.5723067711897},{"$f":"+[1]a2_2ind!AG62","v":7321.7863198472442},{"$f":"+[1]a2_2ind!AH62","v":8019.0997927559511},{"$f":"+[1]a2_2ind!AI62","v":7900.7915835802978}]
[{"$f":"+[1]a2_2ind!AC63","v":"2011-05-01"},{"$f":"+[1]a2_2ind!AD63","v":8505.6418371494547},{"$f":"+[1]a2_2ind!AE63","v":8659.755237288231},{"$f":"+[1]a2_2ind!AF63","v":6148.6198583017585},{"$f":"+[1]a2_2ind!AG63","v":6979.5388779366576},{"$f":"+[1]a2_2ind!AH63","v":8228.2076525187949},{"$f":"+[1]a2_2ind!AI63","v":7948.0350822925393}]
[{"$f":"+[1]a2_2ind!AC64","v":"2011-06-01"},{"$f":"+[1]a2_2ind!AD64","v":8165.3130950645927},{"$f":"+[1]a2_2ind!AE64","v":8719.8272725247461},{"$f":"+[1]a2_2ind!AF64","v":6410.4909248754566},{"$f":"+[1]a2_2ind!AG64","v":6923.2429450864201},{"$f":"+[1]a2_2ind!AH64","v":7839.9870904689205},{"$f":"+[1]a2_2ind!AI64","v":7801.0388166027324}]
[{"$f":"+[1]a2_2ind!AC65","v":"2011-07-01"},{"$f":"+[1]a2_2ind!AD65","v":0},{"$f":"+[1]a2_2ind!AE65","v":0},{"$f":"+[1]a2_2ind!AF65","v":0},{"$f":"+[1]a2_2ind!AG65","v":0},{"$f":"+[1]a2_2ind!AH65","v":0},{"$f":"+[1]a2_2ind!AI65","v":0}]
[{"$f":"+[1]a2_2ind!AC66","v":"2011-08-01"},{"$f":"+[1]a2_2ind!AD66","v":0},{"$f":"+[1]a2_2ind!AE66","v":0},{"$f":"+[1]a2_2ind!AF66","v":0},{"$f":"+[1]a2_2ind!AG66","v":0},{"$f":"+[1]a2_2ind!AH66","v":0},{"$f":"+[1]a2_2ind!AI66","v":0}]
[{"$f":"+[1]a2_2ind!AC67","v":"2011-09-01"},{"$f":"+[1]a2_2ind!AD67","v":0},{"$f":"+[1]a2_2ind!AE67","v":0},{"$f":"+[1]a2_2ind!AF67","v":0},{"$f":"+[1]a2_2ind!AG67","v":0},{"$f":"+[1]a2_2ind!AH67","v":0},{"$f":"+[1]a2_2ind!AI67","v":0}]
[{"$f":"+[1]a2_2ind!AC68","v":"2011-10-01"},{"$f":"+[1]a2_2ind!AD68","v":0},{"$f":"+[1]a2_2ind!AE68","v":0},{"$f":"+[1]a2_2ind!AF68","v":0},{"$f":"+[1]a2_2ind!AG68","v":0},{"$f":"+[1]a2_2ind!AH68","v":0},{"$f":"+[1]a2_2ind!AI68","v":0}]
[{"$f":"+[1]a2_2ind!AC69","v":"2011-11-01"},{"$f":"+[1]a2_2ind!AD69","v":0},{"$f":"+[1]a2_2ind!AE69","v":0},{"$f":"+[1]a2_2ind!AF69","v":0},{"$f":"+[1]a2_2ind!AG69","v":0},{"$f":"+[1]a2_2ind!AH69","v":0},{"$f":"+[1]a2_2ind!AI69","v":0}]
[{"$f":"+[1]a2_2ind!AC70","v":"2011-12-01"},{"$f":"+[1]a2_2ind!AD70","v":0},{"$f":"+[1]a2_2ind!AE70","v":0},{"$f":"+[1]a2_2ind!AF70","v":0},{"$f":"+[1]a2_2ind!AG70","v":0},{"$f":"+[1]a2_2ind!AH70","v":0},{"$f":"+[1]a2_2ind!AI70","v":0}]
[{"$f":"+[1]a2_2ind!AC71","v":"00:00:00"},{"$f":"+[1]a2_2ind!AD71","v":0},{"$f":"+[1]a2_2ind!AE71","v":0},{"$f":"+[1]a2_2ind!AF71","v":0},{"$f":"+[1]a2_2ind!AG71","v":0},{"$f":"+[1]a2_2ind!AH71","v":0},{"$f":"+[1]a2_2ind!AI71","v":0}]
[{"$f":"+[1]a2_2ind!AC72","v":"00:00:00"},{"$f":"+[1]a2_2ind!AD72","v":0},{"$f":"+[1]a2_2ind!AE72","v":0},{"$f":"+[1]a2_2ind!AF72","v":0},{"$f":"+[1]a2_2ind!AG72","v":0},{"$f":"+[1]a2_2ind!AH72","v":0},{"$f":"+[1]a2_2ind!AI72","v":0}]
[{"$f":"+[1]a2_2ind!AC73","v":"00:00:00"},{"$f":"+[1]a2_2ind!AD73","v":0},{"$f":"+[1]a2_2ind!AE73","v":0},{"$f":"+[1]a2_2ind!AF73","v":0},{"$f":"+[1]a2_2ind!AG73","v":0},{"$f":"+[1]a2_2ind!AH73","v":0},{"$f":"+[1]a2_2ind!AI73","v":0}]
[{"$f":"+[1]a2_2ind!AC74","v":"00:00:00"},{"$f":"+[1]a2_2ind!AD74","v":0},{"$f":"+[1]a2_2ind!AE74","v":0},{"$f":"+[1]a2_2ind!AF74","v":0},{"$f":"+[1]a2_2ind!AG74","v":0},{"$f":"+[1]a2_2ind!AH74","v":0},{"$f":"+[1]a2_2ind!AI74","v":0}]
[{"$f":"+[1]a2_2ind!AC75","v":"00:00:00"},{"$f":"+[1]a2_2ind!AD75","v":0},{"$f":"+[1]a2_2ind!AE75","v":0},{"$f":"+[1]a2_2ind!AF75","v":0},{"$f":"+[1]a2_2ind!AG75","v":0},{"$f":"+[1]a2_2ind!AH75","v":0},{"$f":"+[1]a2_2ind!AI75","v":0}]
[{"$f":"+[1]a2_2ind!AC76","v":"00:00:00"},{"$f":"+[1]a2_2ind!AD76","v":0},{"$f":"+[1]a2_2ind!AE76","v":0},{"$f":"+[1]a2_2ind!AF76","v":0},{"$f":"+[1]a2_2ind!AG76","v":0},{"$f":"+[1]a2_2ind!AH76","v":0},{"$f":"+[1]a2_2ind!AI76","v":0}]
[{"$f":"+[1]a2_2ind!AC77","v":"00:00:00"},{"$f":"+[1]a2_2ind!AD77","v":0},{"$f":"+[1]a2_2ind!AE77","v":0},{"$f":"+[1]a2_2ind!AF77","v":0},{"$f":"+[1]a2_2ind!AG77","v":0},{"$f":"+[1]a2_2ind!AH77","v":0},{"$f":"+[1]a2_2ind!AI77","v":0}]
[{"$f":"+[1]a2_2ind!AC78","v":"00:00:00"},{"$f":"+[1]a2_2ind!AD78","v":0},{"$f":"+[1]a2_2ind!AE78","v":0},{"$f":"+[1]a2_2ind!AF78","v":0},{"$f":"+[1]a2_2ind!AG78","v":0},{"$f":"+[1]a2_2ind!AH78","v":0},{"$f":"+[1]a2_2ind!AI78","v":0}]
[{"$f":"+[1]a2_2ind!AC79","v":"00:00:00"},{"$f":"+[1]a2_2ind!AD79","v":0},{"$f":"+[1]a2_2ind!AE79","v":0},{"$f":"+[1]a2_2ind!AF79","v":0},{"$f":"+[1]a2_2ind!AG79","v":0},{"$f":"+[1]a2_2ind!AH79","v":0},{"$f":"+[1]a2_2ind!AI79","v":0}]
[{"$f":"+[1]a2_2ind!AC80","v":"00:00:00"},{"$f":"+[1]a2_2ind!AD80","v":0},{"$f":"+[1]a2_2ind!AE80","v":0},{"$f":"+[1]a2_2ind!AF80","v":0},{"$f":"+[1]a2_2ind!AG80","v":0},{"$f":"+[1]a2_2ind!AH80","v":0},{"$f":"+[1]a2_2ind!AI80","v":0}]
[{"$f":"+[1]a2_2ind!AC81","v":"00:00:00"},{"$f":"+[1]a2_2ind!AD81","v":0},{"$f":"+[1]a2_2ind!AE81","v":0},{"$f":"+[1]a2_2ind!AF81","v":0},{"$f":"+[1]a2_2ind!AG81","v":0},{"$f":"+[1]a2_2ind!AH81","v":0},{"$f":"+[1]a2_2ind!AI81","v":0}]
[{"$f":"+[1]a2_2ind!AC82","v":"00:00:00"},{"$f":"+[1]a2_2ind!AD82","v":0},{"$f":"+[1]a2_2ind!AE82","v":0},{"$f":"+[1]a2_2ind!AF82","v":0},{"$f":"+[1]a2_2ind!AG82","v":0},{"$f":"+[1]a2_2ind!AH82","v":0},{"$f":"+[1]a2_2ind!AI82","v":0}]
[{"$f":"+[1]a2_2ind!AC83","v":"00:00:00"},{"$f":"+[1]a2_2ind!AD83","v":0},{"$f":"+[1]a2_2ind!AE83","v":0},{"$f":"+[1]a2_2ind!AF83","v":0},{"$f":"+[1]a2_2ind!AG83","v":0},{"$f":"+[1]a2_2ind!AH83","v":0},{"$f":"+[1]a2_2ind!AI83","v":0}]

{"sheet":"Hoja1","index":20,"n_rows":0,"n_cols":0,"rows_kept":0,"cut":false,"hidden":false,"merged":[]}